1|2|6|8|3|17|18|3|1|2
2|10|4|9|3|3|2|3|1|0
3|2|5|3|3|3|3|3|1|0
4|2|6|4|17|7|6|3|1|0
5|9|4|1|17|17|17|17|1|1
6|3|2|9|3|3|17|3|1|2
7|4|2|9|3|3|1|3|1|4
8|3|2|0|2|4|18|2|1|0
9|2|8|0|2|3|2|2|1|0
10|4|9|9|3|3|-1|3|1|1
11|9|4|3|3|17|17|3|1|1
12|8|4|0|3|3|1|3|1|0
13|3|5|2|3|3|1|3|1|6
14|3|3|5|3|3|17|3|1|0
15|9|5|9|3|3|3|3|1|1
16|2|1|1|3|17|6|3|1|1
17|3|6|0|3|3|15|3|1|0
18|9|4|3|3|17|17|3|1|2
19|3|5|0|3|1|15|3|1|0
20|9|11|9|3|2|17|3|1|0
21|2|5|3|1|1|1|1|1|1
22|2|5|4|17|17|17|17|1|1
23|9|1|4|17|3|17|17|1|1
24|8|1|9|3|3|17|3|1|0
25|3|3|5|17|18|18|3|1|0
26|3|3|2|3|17|17|3|1|1
27|9|5|3|3|6|3|3|1|0
28|3|5|5|1|1|7|1|1|0
29|3|6|9|3|2|6|6|1|0
30|0|8|5|17|6|3|17|1|0
31|2|1|1|3|3|6|3|1|0
32|8|8|7|3|17|17|3|1|0
33|2|8|2|3|2|-1|3|1|0
34|9|2|4|3|-1|18|3|1|0
35|8|11|4|6|3|17|3|1|0
36|7|8|9|3|17|15|3|1|0
37|2|8|5|6|6|6|6|1|0
38|8|4|5|18|17|1|17|1|1
39|3|1|0|3|3|3|3|1|0
40|3|3|2|3|3|3|3|1|0
41|3|3|8|17|3|17|17|1|0
42|3|2|1|3|3|17|3|1|1
43|8|5|2|17|17|3|17|1|2
44|2|6|4|3|3|17|3|1|1
45|2|6|5|17|17|17|17|-1|0
46|8|7|4|3|2|1|3|1|0
47|4|7|0|3|17|1|3|1|0
48|3|2|1|3|7|3|3|1|0
49|8|8|7|3|3|17|17|1|2
50|2|5|5|3|15|3|3|1|0
51|2|5|1|2|7|16|3|1|0
52|7|8|5|3|12|2|3|1|0
53|2|6|5|6|12|12|6|1|0
54|2|2|6|3|6|4|3|1|0
55|3|6|0|2|12|6|6|1|0
56|2|5|4|17|17|17|17|1|1
57|1|4|8|17|17|6|17|1|1
58|2|6|5|3|17|3|3|1|1
59|3|5|0|3|3|17|3|1|3
60|4|0|0|3|18|18|3|1|2
61|3|3|3|3|6|2|6|1|0
62|8|2|9|3|17|3|3|1|2
63|3|7|7|17|3|3|3|1|0
64|3|5|4|3|3|17|3|1|1
65|10|5|4|3|17|12|3|1|0
66|2|8|8|3|6|6|6|1|0
67|1|8|6|17|17|17|17|0|0
68|1|8|2|3|2|3|3|1|0
69|2|3|5|3|3|2|3|1|0
70|2|3|6|17|18|18|18|1|1
71|3|3|9|3|3|18|3|1|0
72|9|2|7|3|3|2|3|1|1
73|2|8|4|3|3|18|3|1|0
74|3|3|9|3|3|6|3|1|0
75|2|1|0|17|6|17|17|1|0
76|2|8|0|3|3|3|3|1|0
77|3|6|2|3|3|3|3|1|0
78|2|2|6|17|17|6|17|-1|0
79|9|2|0|3|3|3|3|1|0
80|9|2|5|3|17|2|3|1|0
81|2|8|2|17|17|17|17|1|0
82|4|6|2|3|3|17|3|1|1
83|3|4|4|17|18|17|17|1|1
84|3|2|5|3|17|17|17|1|0
85|4|5|2|3|3|3|3|1|2
86|2|2|4|17|2|17|17|1|0
87|3|2|8|17|17|17|17|-1|2
88|9|5|1|3|3|17|3|1|0
89|9|2|6|17|17|17|17|-1|0
90|4|5|7|3|3|3|3|1|2
91|4|7|0|3|3|18|3|1|0
92|3|1|8|3|17|17|17|1|3
93|3|2|2|15|6|15|15|-1|0
94|2|8|7|3|17|17|3|1|3
95|3|2|1|3|3|3|3|1|2
96|8|1|7|3|17|17|3|1|0
97|3|1|9|17|15|3|3|1|0
98|9|2|9|17|17|17|17|-1|0
99|2|8|6|3|3|17|3|1|1
100|3|2|9|3|3|3|3|1|0
101|1|8|0|2|18|17|17|1|0
102|3|6|3|1|17|6|17|1|2
103|2|8|5|3|17|6|6|1|0
104|2|8|5|3|3|3|3|1|1
105|2|3|9|3|3|6|3|1|0
106|4|10|5|3|17|15|3|1|0
107|3|3|6|3|1|2|3|1|0
108|3|5|6|3|6|7|17|1|0
109|2|4|5|3|3|17|3|1|2
110|1|8|7|3|17|17|17|1|1
111|4|3|9|17|3|3|3|1|0
112|3|7|6|3|17|3|3|1|0
113|3|2|9|3|3|17|3|1|0
114|2|6|7|3|3|2|3|1|0
115|3|3|1|3|3|17|3|1|0
116|3|0|9|3|3|3|3|1|1
117|2|8|1|3|17|17|6|1|0
118|2|2|9|3|1|3|1|1|0
119|3|6|6|3|3|17|3|1|1
120|9|4|0|3|6|6|3|1|0
121|4|5|9|3|3|6|3|1|0
122|9|5|2|3|3|3|3|1|0
123|9|1|2|3|3|17|3|1|0
124|3|8|6|6|2|2|6|1|0
125|3|9|2|17|17|17|17|-1|1
126|8|9|2|3|3|5|3|1|0
127|3|4|7|7|-1|2|7|1|0
128|8|7|2|3|3|3|3|1|1
129|9|7|0|17|3|3|3|1|0
130|2|4|6|3|17|6|3|1|3
131|10|2|1|3|3|3|3|1|0
132|2|4|9|3|2|-1|3|1|0
133|4|3|7|3|18|5|3|1|0
134|3|6|8|3|3|18|3|1|0
135|2|8|3|3|6|1|3|1|0
136|4|4|9|3|17|3|3|1|0
137|4|5|8|6|18|13|6|1|0
138|3|0|5|3|15|17|3|1|0
139|2|8|0|3|7|15|3|1|0
140|9|8|3|3|17|4|17|1|0
141|3|6|3|3|17|3|3|1|1
142|0|4|4|17|17|6|17|1|0
143|3|6|0|3|6|2|3|1|0
144|4|6|2|3|3|3|3|1|2
145|3|1|9|3|17|17|3|1|3
146|3|1|8|3|2|17|3|1|0
147|9|5|0|3|3|6|3|1|0
148|3|3|9|17|3|3|3|1|0
149|9|7|1|3|3|3|3|1|0
150|8|1|0|3|3|3|3|1|0
151|9|2|4|3|17|3|3|1|3
152|9|5|6|17|17|17|17|-1|1
153|2|8|6|3|3|2|3|1|0
154|2|8|5|3|3|7|3|1|0
155|9|4|1|2|17|6|3|1|0
156|2|5|0|3|3|4|3|1|0
157|4|3|7|3|6|6|17|1|0
158|4|5|2|17|6|7|17|1|1
159|8|8|5|17|17|17|17|1|1
160|2|6|6|3|3|3|3|1|1
161|4|9|5|3|3|3|3|1|0
162|2|1|1|6|6|17|6|1|0
163|3|2|9|3|17|3|3|1|0
164|3|0|8|6|6|17|6|1|0
165|8|4|5|3|5|1|3|1|0
166|3|5|5|6|17|2|6|1|0
167|3|4|9|3|17|17|17|1|0
168|3|4|8|3|6|17|3|1|0
169|10|4|5|2|17|5|2|1|0
170|10|0|3|2|17|-1|17|1|0
171|9|5|7|3|2|1|3|1|0
172|4|7|2|17|3|3|3|1|0
173|4|4|2|3|3|2|3|1|0
174|9|2|5|3|18|17|17|-1|1
175|8|3|2|3|6|3|3|1|0
176|2|3|0|3|3|12|3|1|0
177|2|6|1|3|3|17|3|1|1
178|2|4|4|3|17|17|17|1|2
179|1|1|2|3|3|3|3|1|0
180|8|2|6|3|3|17|17|1|0
181|2|2|2|3|3|3|3|1|4
182|3|6|3|3|3|15|3|1|0
183|3|3|2|7|6|7|7|1|0
184|3|5|7|3|3|6|3|1|2
185|10|5|9|3|3|3|3|1|0
186|9|2|0|6|3|4|6|1|0
187|2|5|1|3|3|12|3|1|0
188|3|8|2|3|3|17|3|1|1
189|3|1|9|3|3|17|3|1|1
190|3|2|9|3|6|3|3|1|0
191|3|2|9|3|3|3|3|1|0
192|3|5|9|3|17|17|3|1|0
193|2|8|4|3|17|6|17|1|1
194|3|2|0|3|17|17|3|1|3
195|3|3|9|3|3|6|3|1|0
196|3|5|5|17|17|17|17|-1|0
197|4|6|7|3|3|3|3|1|1
198|8|8|5|3|3|17|3|1|1
199|3|5|1|3|6|18|3|1|0
200|3|6|9|3|6|17|3|1|2
201|2|5|9|3|3|3|3|1|3
202|9|5|6|17|17|2|17|0|0
203|8|8|3|2|3|3|3|1|0
204|10|5|1|3|2|3|3|1|0
205|3|9|0|3|17|15|3|1|0
206|6|8|5|3|3|3|3|1|0
207|3|7|9|3|17|17|3|1|2
208|3|3|0|17|17|3|17|-1|0
209|9|5|8|17|3|17|17|1|0
210|3|3|0|17|17|17|17|1|1
211|5|7|3|2|3|2|3|1|0
212|9|5|6|3|3|3|3|1|0
213|3|2|5|3|17|2|3|1|1
214|8|5|1|3|17|15|3|1|1
215|3|6|6|3|3|18|3|1|0
216|2|3|0|3|17|17|3|1|1
217|2|4|1|6|7|8|6|1|0
218|3|2|0|17|3|4|3|1|0
219|3|6|4|3|3|6|3|1|0
220|3|5|7|17|12|3|17|1|0
221|1|8|2|3|17|17|3|1|1
222|2|6|2|3|17|17|3|1|3
223|7|8|4|17|17|3|17|1|1
224|9|5|4|3|3|3|3|1|1
225|10|2|5|3|-1|16|3|1|0
226|2|8|9|3|3|3|3|1|0
227|3|2|6|3|3|17|3|1|0
228|8|8|2|3|3|3|3|1|0
229|8|5|2|3|3|3|3|1|0
230|8|8|1|3|18|17|3|1|1
231|3|5|0|2|17|18|3|1|0
232|3|3|9|3|3|18|3|1|0
233|3|3|9|3|18|4|3|1|1
234|4|10|9|3|3|3|3|1|4
235|3|5|2|3|3|17|3|1|0
236|9|5|5|3|3|17|3|1|1
237|3|2|6|3|2|3|3|1|0
238|9|2|4|2|17|18|17|-1|0
239|3|1|9|3|3|3|3|1|1
240|8|5|2|3|6|6|1|1|0
241|8|8|2|3|3|1|3|1|0
242|3|5|3|15|5|-1|15|1|0
243|3|5|6|3|3|3|3|1|0
244|2|6|8|3|17|17|17|1|2
245|2|8|5|18|17|18|18|-1|0
246|1|8|2|3|17|6|17|1|1
247|2|3|2|3|3|2|3|1|0
248|2|8|3|3|17|2|3|1|0
249|2|8|8|3|17|6|3|1|1
250|2|2|9|3|6|6|3|1|1
251|2|0|8|3|6|17|6|1|0
252|3|3|0|3|17|-1|3|1|0
253|8|5|2|3|17|18|3|1|0
254|3|5|4|3|18|17|18|1|1
255|2|1|0|1|1|6|1|1|0
256|9|4|3|17|3|17|17|1|2
257|1|8|7|3|17|4|3|1|0
258|7|8|7|3|18|12|3|1|0
259|2|8|4|3|3|2|3|1|0
260|9|1|8|3|1|17|3|1|0
261|2|2|8|6|17|18|6|1|0
262|7|8|7|17|17|17|17|1|1
263|3|6|5|3|18|5|3|1|1
264|9|5|9|17|17|17|17|1|1
265|2|2|8|3|3|3|3|1|0
266|10|2|7|3|15|3|3|1|0
267|2|3|8|3|17|17|17|1|1
268|2|3|1|3|17|17|17|1|3
269|9|5|4|3|3|17|3|1|3
270|7|8|6|3|3|3|3|1|1
271|4|3|2|3|3|17|3|1|2
272|3|3|5|3|1|2|3|1|0
273|10|4|1|3|3|1|3|1|0
274|8|8|5|3|17|15|17|1|0
275|3|3|9|2|18|18|18|1|0
276|2|8|9|3|3|17|3|1|5
277|9|2|5|3|3|12|3|1|0
278|9|5|3|3|2|17|3|1|0
279|3|6|8|17|17|17|17|-1|4
280|9|5|2|17|17|6|17|1|2
281|7|8|0|2|17|17|18|1|0
282|2|2|2|3|6|3|3|1|0
283|2|6|5|17|17|1|17|-1|0
284|3|2|9|3|3|18|3|1|0
285|2|6|5|3|17|12|3|1|0
286|2|8|1|17|17|17|17|-1|2
287|2|7|3|3|17|17|3|1|0
288|3|7|2|3|3|2|3|1|0
289|0|4|9|6|3|18|6|1|0
290|3|3|9|17|3|7|17|1|1
291|1|8|4|3|17|17|3|1|2
292|9|6|9|3|6|15|3|1|1
293|2|5|6|3|3|17|3|1|3
294|3|6|9|6|17|6|6|1|1
295|3|5|5|3|17|6|17|1|1
296|9|2|1|3|17|17|3|1|1
297|8|5|9|3|17|2|3|1|1
298|3|2|0|3|17|18|3|1|1
299|2|0|6|3|3|17|3|1|2
300|8|6|5|17|3|6|17|0|0
301|2|8|5|17|17|17|17|1|2
302|3|5|7|2|5|3|2|1|0
303|1|8|1|17|3|17|17|1|4
304|8|8|7|15|1|18|17|1|0
305|2|6|9|3|3|3|3|1|2
306|3|4|7|17|17|12|17|-1|0
307|2|8|5|17|3|17|17|1|1
308|4|10|9|3|3|4|3|1|3
309|3|3|7|17|18|3|2|1|0
310|3|5|9|15|7|17|17|-1|0
311|3|6|7|3|17|3|3|1|2
312|3|4|0|3|3|6|3|1|2
313|3|7|6|3|17|17|3|1|2
314|8|8|0|3|17|17|17|-1|2
315|3|5|1|3|17|1|3|1|0
316|9|4|7|3|3|3|3|1|0
317|2|2|1|6|2|6|6|1|0
318|5|10|0|3|17|17|3|0|1
319|3|6|2|3|3|18|3|1|0
320|1|8|2|6|17|6|6|1|1
321|9|5|5|3|3|17|3|1|1
322|2|8|5|3|3|18|3|1|0
323|2|8|1|3|3|12|3|1|0
324|8|8|0|3|3|15|3|1|0
325|3|6|0|3|3|3|3|1|1
326|3|2|1|3|1|3|3|1|1
327|2|8|1|3|17|17|3|1|2
328|4|2|0|3|3|3|3|1|2
329|3|5|0|3|4|17|3|1|0
330|9|5|3|17|3|2|3|1|1
331|3|1|9|3|3|4|3|1|0
332|2|8|4|6|3|6|6|1|1
333|3|4|9|17|17|2|17|0|0
334|3|5|3|3|3|3|3|1|3
335|3|2|3|3|5|5|5|1|0
336|2|7|4|17|17|17|17|-1|1
337|3|3|1|7|2|3|2|1|0
338|9|5|5|17|17|17|17|-1|0
339|3|9|3|3|3|17|3|1|2
340|3|3|8|17|2|12|17|-1|0
341|7|8|4|3|17|6|17|1|0
342|8|4|9|3|3|17|3|1|2
343|3|3|3|3|3|6|3|1|2
344|9|5|9|3|3|17|3|1|1
345|8|5|9|3|3|3|3|1|2
346|3|4|7|6|3|3|3|1|1
347|1|8|9|3|3|17|3|1|1
348|8|8|4|3|18|17|17|1|0
349|5|10|6|3|3|17|3|1|0
350|3|8|9|3|2|2|2|1|0
351|4|5|4|3|1|3|3|1|0
352|9|6|5|3|7|1|3|1|0
353|2|3|2|3|6|3|3|1|0
354|8|5|4|3|3|17|3|1|2
355|2|8|6|6|2|-1|3|1|0
356|9|11|9|3|3|17|3|1|0
357|2|2|9|17|17|17|17|1|0
358|3|5|1|3|3|3|3|1|0
359|2|8|6|2|6|-1|6|1|0
360|4|4|9|3|3|6|3|1|1
361|2|8|4|3|17|3|3|1|1
362|9|11|8|3|17|6|3|1|0
363|2|8|8|3|3|3|3|1|3
364|4|3|0|17|15|17|17|-1|0
365|2|9|2|3|15|17|3|1|0
366|8|8|5|1|6|1|1|1|0
367|1|8|3|1|1|1|1|1|0
368|1|8|9|1|1|1|1|1|0
369|2|8|9|3|17|17|3|1|0
370|4|5|0|3|17|17|17|1|0
371|3|3|9|3|17|12|3|1|0
372|8|8|6|3|3|1|3|1|0
373|8|4|5|3|17|3|3|1|2
374|3|2|7|3|3|17|3|1|2
375|1|1|3|1|6|6|6|1|0
376|8|4|1|3|15|-1|17|1|0
377|2|8|1|3|6|6|3|1|0
378|3|8|0|3|3|17|3|1|3
379|3|6|9|3|3|17|3|1|1
380|3|3|5|3|3|17|3|1|1
381|3|1|9|3|3|3|3|1|1
382|3|3|0|3|3|12|3|1|0
383|3|2|7|3|3|3|3|1|0
384|4|6|4|3|3|-1|3|1|0
385|3|5|1|3|3|3|3|1|2
386|3|7|4|6|6|6|6|1|0
387|3|1|3|3|3|3|3|1|3
388|3|4|3|1|3|15|3|1|0
389|9|5|8|3|17|17|17|-1|2
390|9|5|8|3|16|3|3|1|0
391|2|8|8|3|3|3|3|1|1
392|4|5|5|3|17|2|3|1|1
393|1|8|8|3|17|17|17|1|4
394|2|2|9|17|17|17|17|1|1
395|3|4|4|3|6|17|3|1|0
396|4|3|9|6|6|3|3|1|0
397|1|8|2|3|6|3|3|1|1
398|3|4|6|3|17|17|3|1|1
399|2|4|9|3|3|17|3|1|3
400|9|2|7|17|18|3|17|1|0
401|9|0|8|3|3|18|3|1|1
402|3|3|9|3|17|17|3|1|0
403|3|4|0|2|3|17|17|1|0
404|8|6|5|17|2|3|3|1|0
405|8|0|1|3|17|3|3|1|6
406|4|5|9|3|17|17|3|1|3
407|2|3|0|3|17|17|17|1|2
408|2|8|6|3|2|5|3|1|0
409|3|2|9|3|17|3|3|1|2
410|9|1|9|3|3|3|3|1|0
411|3|5|4|3|7|6|3|1|0
412|2|5|1|3|17|17|3|1|0
413|4|5|7|3|17|5|3|1|0
414|2|6|3|3|6|17|3|1|0
415|3|5|8|3|2|18|6|1|0
416|8|8|9|3|17|3|3|1|4
417|8|4|4|17|17|17|17|1|3
418|10|4|2|1|6|3|3|1|0
419|3|9|4|15|3|3|3|1|0
420|4|5|0|3|3|-1|3|1|0
421|9|6|5|3|1|12|3|1|0
422|2|1|9|1|3|3|1|1|0
423|4|4|9|3|3|3|3|1|0
424|9|7|5|3|2|18|3|1|0
425|1|8|5|3|6|6|6|1|2
426|4|5|0|3|17|3|3|1|1
427|4|0|8|3|17|3|3|1|0
428|2|8|5|3|3|2|3|1|0
429|2|8|2|3|3|3|3|1|4
430|3|3|9|3|6|1|3|1|0
431|2|7|9|2|4|6|6|1|0
432|2|1|5|3|6|17|17|1|0
433|2|1|1|3|2|5|3|1|0
434|7|8|4|17|15|3|17|1|0
435|2|3|6|3|17|17|17|1|3
436|9|2|1|3|17|17|3|1|1
437|8|4|2|3|17|3|3|1|2
438|10|2|4|17|17|17|17|1|0
439|8|2|2|15|3|2|3|1|0
440|3|4|4|3|6|17|3|1|0
441|4|6|5|3|3|1|3|1|0
442|2|8|8|17|6|17|17|1|1
443|3|7|3|3|2|6|2|1|0
444|10|9|5|3|12|2|3|1|0
445|2|5|9|3|3|3|3|1|1
446|4|5|6|3|2|3|3|1|0
447|3|2|5|3|17|17|17|1|1
448|2|1|1|3|3|3|3|1|0
449|2|5|5|3|3|17|3|1|0
450|9|5|1|3|17|17|3|1|5
451|1|8|4|3|3|3|3|1|0
452|3|2|2|3|3|3|3|1|2
453|1|8|0|3|17|17|17|1|1
454|4|4|9|3|3|3|3|1|2
455|3|2|8|3|3|17|3|1|1
456|2|6|3|3|3|3|3|1|2
457|9|7|3|3|17|17|3|1|2
458|3|6|9|3|3|3|3|1|1
459|2|8|2|17|6|17|17|1|1
460|9|4|6|3|3|3|3|1|0
461|1|8|9|3|17|17|17|1|0
462|7|8|0|3|18|6|3|1|0
463|9|0|7|3|17|17|3|1|1
464|4|5|9|17|2|5|3|1|0
465|3|4|0|3|2|3|3|1|0
466|2|8|9|3|3|6|3|1|1
467|2|3|9|3|3|6|3|1|0
468|2|3|0|3|3|17|3|1|1
469|4|5|7|3|15|-1|3|1|0
470|2|6|1|3|3|15|3|1|0
471|0|8|7|18|18|18|18|-1|0
472|2|8|8|17|18|18|17|1|2
473|2|8|9|3|17|12|3|1|0
474|4|2|9|3|3|17|3|1|3
475|3|6|7|3|4|3|3|1|0
476|2|8|6|17|17|17|17|-1|0
477|8|8|0|17|-1|-1|17|-1|0
478|2|4|1|3|17|3|17|1|1
479|3|5|5|3|6|17|3|1|2
480|4|10|9|3|3|1|3|1|0
481|5|10|3|17|3|2|17|1|0
482|7|8|4|17|17|18|17|1|0
483|2|3|4|2|3|3|3|1|0
484|2|8|2|3|6|7|3|1|1
485|9|5|9|17|1|2|17|1|0
486|3|5|9|3|3|3|3|1|1
487|2|3|9|3|17|6|3|1|2
488|3|6|2|3|3|3|3|1|1
489|4|4|4|3|17|3|3|1|1
490|8|1|9|3|3|18|3|1|0
491|9|5|5|3|3|3|3|1|0
492|4|5|9|3|3|3|3|1|0
493|2|3|6|17|3|17|3|1|1
494|9|2|4|3|3|3|3|1|0
495|2|3|0|3|3|18|3|1|2
496|8|8|5|2|3|3|3|1|1
497|2|8|5|17|17|17|17|1|2
498|2|5|5|3|3|3|3|1|1
499|3|6|7|3|2|3|3|1|1
500|2|2|9|3|17|3|3|1|2
501|2|8|1|3|17|-1|3|1|0
502|2|8|2|1|18|18|1|1|0
503|10|5|2|3|17|3|3|1|1
504|9|5|9|3|17|17|3|1|2
505|8|4|2|3|3|3|3|1|1
506|3|6|0|17|3|3|3|1|2
507|7|5|2|6|6|17|6|1|0
508|2|7|1|17|17|6|17|1|0
509|2|2|1|2|6|2|2|1|0
510|3|4|9|3|2|3|3|1|0
511|2|8|2|3|5|3|3|1|0
512|2|4|2|3|12|3|3|1|0
513|3|2|2|6|12|-1|6|1|0
514|2|6|2|17|17|17|17|1|1
515|4|7|4|1|3|2|3|1|0
516|10|5|1|2|2|-1|2|1|0
517|2|8|5|6|17|17|17|1|0
518|9|5|9|3|3|17|3|1|0
519|2|4|5|3|3|18|3|1|0
520|4|0|1|3|17|17|17|0|0
521|1|8|0|17|3|17|17|1|1
522|3|3|5|3|6|17|3|1|0
523|10|2|0|17|17|3|17|-1|0
524|4|5|0|3|3|3|3|1|3
525|8|2|1|3|3|17|3|1|0
526|3|7|9|3|3|3|3|1|0
527|3|5|1|3|3|3|3|1|1
528|1|8|5|3|17|18|17|1|0
529|9|2|4|3|2|6|6|1|0
530|2|3|9|3|2|2|3|1|0
531|9|7|9|3|16|17|3|1|0
532|2|8|9|3|17|17|3|1|2
533|3|5|0|3|3|17|3|1|2
534|2|8|0|17|18|3|3|1|0
535|9|5|8|3|3|3|3|1|2
536|3|3|3|3|3|17|3|1|1
537|3|3|2|3|3|3|3|1|4
538|3|3|2|3|3|17|3|1|0
539|10|2|8|3|3|3|3|1|0
540|2|3|9|3|3|2|3|1|0
541|7|8|8|18|17|17|18|-1|1
542|2|8|6|17|17|17|17|-1|1
543|3|3|9|3|3|17|3|1|1
544|9|4|2|3|3|3|3|1|0
545|2|6|0|17|3|7|17|1|1
546|3|2|2|1|1|3|1|1|0
547|4|5|1|3|17|17|3|1|0
548|4|5|9|3|3|3|3|1|1
549|3|3|4|2|3|6|3|1|0
550|7|8|9|3|17|18|18|1|0
551|2|6|5|3|3|17|3|1|3
552|3|4|6|3|17|17|17|1|0
553|4|5|6|3|3|3|3|1|0
554|3|3|6|3|17|6|3|1|1
555|8|5|2|17|2|3|17|1|0
556|9|5|3|3|15|3|3|1|0
557|9|5|1|3|3|3|3|1|0
558|10|5|6|3|3|3|3|1|0
559|5|2|1|3|3|17|3|1|0
560|3|8|1|3|3|17|3|1|1
561|2|3|6|3|3|17|3|1|3
562|10|2|2|3|2|3|3|1|0
563|9|5|3|17|17|18|17|-1|0
564|5|10|9|3|6|6|6|1|0
565|3|8|5|3|17|17|3|1|0
566|2|8|1|3|3|17|3|1|1
567|2|1|1|3|3|2|3|1|1
568|3|5|0|3|3|17|3|1|0
569|3|5|9|3|6|3|3|1|0
570|2|5|1|3|12|2|2|1|0
571|3|1|0|3|3|11|3|1|0
572|4|5|2|17|3|3|3|1|0
573|5|10|4|3|2|16|3|1|0
574|4|5|5|3|3|3|3|1|0
575|3|7|4|3|3|3|3|1|0
576|3|2|9|17|17|18|17|1|0
577|9|8|7|3|17|12|3|1|1
578|3|2|9|6|3|15|3|1|0
579|3|5|4|17|17|17|17|-1|0
580|1|8|1|2|3|6|6|1|0
581|3|4|9|3|17|3|3|1|0
582|1|8|9|3|6|17|3|1|0
583|3|3|2|3|-1|3|3|1|0
584|2|8|2|7|7|7|7|1|0
585|5|5|9|3|3|3|3|1|0
586|2|8|7|6|3|17|3|1|1
587|2|4|1|3|3|17|3|1|0
588|7|8|9|3|3|3|3|1|2
589|2|9|9|3|2|17|3|1|0
590|4|5|8|3|3|17|3|1|0
591|10|5|9|3|17|17|17|-1|0
592|1|8|9|3|3|17|3|1|3
593|9|5|6|3|17|17|3|1|1
594|3|5|9|3|2|17|2|1|0
595|2|6|3|3|17|17|3|1|0
596|2|1|7|2|3|17|1|1|0
597|2|4|8|6|17|3|6|1|0
598|9|7|4|3|5|1|3|1|0
599|8|8|9|17|15|17|17|-1|0
600|3|6|0|7|6|8|7|1|0
601|7|1|9|3|3|18|3|1|1
602|9|4|3|18|6|1|18|1|0
603|2|6|4|2|7|2|7|1|0
604|3|5|1|1|1|1|1|1|0
605|3|3|3|3|17|6|3|1|0
606|2|6|6|3|17|17|3|1|2
607|9|0|0|3|3|2|3|1|0
608|2|4|1|3|3|17|3|1|1
609|6|8|5|3|12|18|18|-1|0
610|2|8|2|3|3|17|3|1|0
611|3|5|7|3|1|3|3|1|0
612|3|5|7|3|17|18|18|-1|0
613|9|7|2|3|3|1|3|1|0
614|4|5|8|3|17|17|3|1|0
615|3|5|2|3|3|3|3|1|1
616|4|3|5|3|3|1|3|1|0
617|8|5|1|1|1|1|1|1|1
618|7|8|4|3|3|3|3|1|2
619|1|8|4|6|6|4|6|1|0
620|7|5|8|18|18|18|18|1|1
621|1|8|6|17|17|18|17|1|1
622|2|6|1|3|17|17|17|1|2
623|10|5|6|17|17|17|17|1|0
624|1|8|3|3|17|17|3|1|1
625|2|6|2|2|17|17|17|1|1
626|2|3|1|3|1|6|3|1|0
627|2|3|0|3|3|3|3|1|1
628|0|4|9|3|15|18|3|1|0
629|9|4|4|3|17|4|3|1|1
630|8|0|5|17|3|3|3|1|1
631|7|8|3|3|2|17|3|1|0
632|1|8|5|3|3|17|3|1|1
633|3|6|5|6|3|17|3|1|0
634|3|3|9|3|3|3|3|1|1
635|2|4|2|15|3|6|17|1|0
636|3|5|4|3|15|-1|3|1|0
637|3|4|7|2|3|3|3|1|1
638|3|3|0|2|7|7|7|1|0
639|9|5|1|3|3|3|3|1|1
640|2|8|6|17|17|17|17|1|1
641|2|8|6|3|3|3|3|1|0
642|7|8|9|17|17|17|17|-1|3
643|3|3|5|3|17|17|17|1|2
644|4|10|6|3|5|16|3|1|0
645|2|6|5|3|3|18|3|1|1
646|7|8|5|3|3|17|3|1|0
647|3|5|4|3|17|12|3|1|0
648|3|3|9|17|17|17|17|1|2
649|2|8|3|6|12|2|6|1|0
650|3|3|8|3|3|17|3|1|3
651|5|10|0|3|17|17|17|1|0
652|3|4|2|6|2|17|6|1|0
653|3|2|5|3|3|17|3|1|2
654|8|8|7|3|17|17|17|1|1
655|10|0|6|3|3|3|3|1|6
656|3|5|1|3|3|2|3|1|0
657|8|4|7|3|3|6|3|1|0
658|3|6|9|3|3|17|3|1|0
659|3|5|5|3|3|1|3|1|1
660|2|8|7|3|3|17|17|1|2
661|2|6|9|3|3|3|3|1|1
662|4|5|1|3|2|5|3|1|0
663|2|4|1|3|17|3|3|1|1
664|3|3|9|3|3|15|3|1|1
665|2|2|5|3|17|6|3|1|1
666|3|2|6|3|17|3|3|1|2
667|3|5|0|3|3|1|3|1|0
668|8|5|1|3|3|3|3|1|0
669|3|4|2|3|3|6|3|1|0
670|3|6|2|6|17|3|3|1|0
671|2|6|9|6|6|3|6|1|1
672|10|2|9|17|3|17|17|-1|0
673|4|5|2|3|17|12|3|1|0
674|6|8|5|17|6|18|3|1|0
675|3|4|2|3|3|3|3|1|0
676|3|6|3|3|2|17|3|1|0
677|2|4|9|6|18|3|3|1|0
678|4|5|6|3|3|3|3|1|0
679|8|8|5|3|17|17|17|1|0
680|3|9|9|17|3|6|17|1|0
681|9|7|9|2|18|18|18|1|0
682|2|6|5|3|17|17|3|1|3
683|3|5|2|3|3|3|3|1|0
684|2|8|5|17|17|17|17|-1|0
685|9|5|5|-1|3|3|3|1|0
686|3|5|2|3|6|3|3|1|0
687|9|0|2|17|2|6|17|1|0
688|9|2|6|3|-1|4|3|1|0
689|2|4|4|6|18|17|6|1|0
690|3|7|6|17|17|17|17|-1|1
691|3|5|6|3|18|18|3|1|0
692|3|3|1|17|17|17|17|-1|0
693|9|0|8|3|3|3|3|1|1
694|4|6|0|3|3|-1|3|1|1
695|2|5|3|3|3|6|3|1|0
696|4|4|9|3|3|6|3|1|0
697|2|4|7|3|17|6|3|1|1
698|8|6|0|17|17|3|17|1|1
699|3|4|9|3|3|3|3|1|1
700|1|8|7|2|17|-1|2|1|0
701|10|5|5|3|6|-1|3|1|0
702|3|4|8|7|18|2|7|1|0
703|2|5|4|3|3|17|3|1|0
704|10|5|9|3|3|2|3|1|0
705|8|8|5|6|3|3|18|1|1
706|2|8|5|17|4|3|3|1|0
707|10|5|1|3|3|3|3|1|2
708|8|11|9|17|3|17|17|1|1
709|2|4|9|3|6|1|3|1|1
710|1|8|9|3|3|3|3|1|0
711|8|8|1|3|3|17|3|1|2
712|8|8|5|17|17|3|17|-1|1
713|9|4|0|3|3|3|3|1|0
714|2|3|5|6|17|3|6|1|0
715|2|6|9|3|17|17|17|1|1
716|9|2|4|3|3|17|3|1|2
717|2|6|8|3|6|6|3|1|0
718|3|6|6|6|17|17|6|1|0
719|9|4|9|3|3|17|3|1|0
720|9|2|1|3|17|3|3|1|0
721|8|1|1|3|3|3|3|1|1
722|10|11|1|3|6|17|17|1|0
723|2|2|9|2|3|16|3|1|0
724|3|2|4|3|3|3|3|1|0
725|2|8|9|3|17|6|17|1|0
726|8|2|8|17|17|17|17|-1|0
727|2|8|7|17|17|17|17|1|3
728|4|2|9|3|6|18|3|1|0
729|1|8|5|6|3|17|17|1|0
730|9|3|3|12|15|17|3|1|0
731|9|5|7|3|3|3|3|1|0
732|8|4|9|2|17|3|17|1|0
733|9|4|6|3|3|3|3|1|1
734|8|4|6|3|3|6|3|1|0
735|8|0|8|3|3|3|3|1|0
736|9|5|9|3|5|6|3|1|0
737|3|6|9|3|3|6|3|1|0
738|3|6|9|3|6|17|17|1|1
739|3|6|7|3|3|2|3|1|0
740|8|5|2|17|5|17|17|1|0
741|2|5|6|3|17|6|17|1|1
742|3|8|2|3|17|6|3|1|0
743|3|6|9|3|3|17|3|1|0
744|3|7|4|3|3|3|3|1|0
745|3|5|5|3|3|3|3|1|0
746|2|3|1|6|6|7|6|1|0
747|1|4|9|3|17|17|3|1|2
748|2|2|9|3|17|17|3|1|1
749|3|4|8|3|3|17|3|1|3
750|2|2|3|3|6|17|17|1|0
751|8|4|9|17|17|3|17|1|1
752|4|10|2|3|3|3|3|1|0
753|4|7|9|3|3|6|3|1|0
754|10|5|6|3|3|6|3|1|0
755|9|5|9|2|17|3|3|1|0
756|9|4|9|3|18|3|18|1|1
757|2|8|5|3|6|6|6|1|1
758|2|8|5|3|3|3|3|1|3
759|8|8|6|6|4|3|6|1|0
760|9|4|1|17|2|17|17|1|0
761|1|8|9|3|3|3|3|1|0
762|3|2|9|15|17|17|15|1|0
763|2|3|0|3|3|17|3|1|1
764|8|5|6|3|3|17|3|1|1
765|3|8|3|3|15|3|3|1|0
766|3|4|1|3|3|3|3|1|1
767|5|3|0|3|2|-1|3|1|0
768|2|2|1|3|17|3|3|1|0
769|3|2|0|17|17|6|17|0|0
770|2|8|1|3|2|17|3|1|0
771|2|8|1|17|17|3|17|-1|0
772|4|5|2|3|6|18|3|1|0
773|2|8|5|3|3|3|3|1|1
774|3|8|8|2|3|17|3|1|2
775|3|2|9|3|3|3|3|1|0
776|3|5|5|3|1|1|1|1|1
777|4|6|0|3|3|3|3|1|0
778|3|8|0|17|3|3|17|1|0
779|3|8|9|18|17|3|17|1|0
780|3|6|9|2|3|17|3|1|0
781|2|8|4|3|3|2|3|1|0
782|8|1|3|3|3|3|3|1|2
783|3|7|7|3|17|3|3|1|0
784|3|2|9|3|3|-1|3|1|0
785|3|3|2|17|17|3|17|1|0
786|9|3|0|3|3|17|3|1|1
787|7|8|9|3|3|15|3|1|0
788|4|2|0|3|3|17|3|1|2
789|2|4|5|3|3|3|3|1|0
790|2|6|8|3|17|17|17|1|2
791|3|5|2|3|17|3|3|1|0
792|3|6|1|3|3|17|3|1|0
793|2|8|8|3|3|6|3|1|0
794|3|5|5|3|17|6|3|1|0
795|3|6|0|3|17|17|17|1|1
796|9|5|3|3|3|17|3|1|3
797|9|4|6|2|17|3|17|1|0
798|9|5|6|17|17|17|17|-1|2
799|9|2|1|3|3|6|3|1|0
800|2|6|5|3|17|3|3|1|0
801|2|5|9|1|2|3|1|1|0
802|3|2|3|1|1|1|1|1|0
803|5|2|7|3|5|17|17|1|0
804|3|5|6|3|17|17|17|1|3
805|8|4|2|3|3|17|3|1|2
806|2|7|1|3|3|6|3|1|1
807|9|0|9|18|18|18|18|1|2
808|3|7|9|3|2|3|3|1|0
809|10|7|3|3|5|3|3|1|0
810|10|4|8|17|17|-1|17|1|0
811|9|5|7|17|18|16|17|1|0
812|2|6|7|17|6|2|6|1|0
813|6|8|0|3|18|18|3|1|0
814|3|4|1|1|1|1|1|1|0
815|3|4|2|3|3|17|3|1|1
816|3|4|2|6|5|18|6|1|0
817|1|8|6|6|3|6|6|1|0
818|2|5|2|3|17|6|3|1|0
819|4|2|4|3|2|17|3|1|0
820|2|8|3|1|3|6|6|1|0
821|3|3|7|3|6|3|3|1|0
822|8|5|5|17|6|18|18|-1|0
823|2|1|5|3|17|18|17|1|1
824|3|4|1|18|3|2|18|1|0
825|3|3|0|6|17|15|3|1|1
826|2|1|7|3|18|18|18|1|1
827|8|3|8|17|3|3|3|1|0
828|2|5|8|3|3|3|3|1|1
829|3|5|8|3|17|15|3|1|0
830|3|6|5|3|18|1|3|1|1
831|2|4|3|3|3|3|3|1|0
832|2|6|7|2|2|17|2|1|0
833|3|5|9|3|3|17|3|1|2
834|2|4|6|3|3|3|3|1|0
835|9|2|1|3|3|18|3|1|1
836|3|1|1|3|3|5|3|1|0
837|9|1|5|17|3|17|17|-1|0
838|2|8|0|17|3|2|3|1|0
839|9|1|9|3|3|17|3|1|0
840|3|1|5|3|3|6|3|1|1
841|3|0|4|3|6|1|3|1|0
842|3|5|9|3|12|5|3|1|0
843|3|5|4|12|3|3|3|1|2
844|2|3|9|17|2|17|17|1|0
845|4|0|9|3|3|3|3|1|0
846|2|9|4|3|3|3|3|1|4
847|2|8|5|17|17|17|17|1|1
848|3|3|0|17|3|3|3|1|1
849|7|8|2|3|-1|-1|3|1|0
850|3|6|7|17|3|3|17|1|0
851|1|4|2|3|17|17|3|1|2
852|3|2|9|18|6|17|6|1|0
853|3|5|4|3|2|3|3|1|0
854|8|8|5|3|3|3|3|1|2
855|4|5|0|3|3|3|3|1|0
856|9|7|9|3|3|3|3|1|0
857|9|2|9|15|15|3|3|1|0
858|4|5|0|3|3|2|3|1|0
859|7|4|0|3|3|18|3|1|0
860|11|10|4|3|3|17|3|1|0
861|9|8|1|3|3|12|3|1|0
862|2|2|1|3|6|1|3|1|1
863|1|8|6|3|3|3|3|1|1
864|2|6|6|3|17|17|3|1|2
865|2|1|1|12|18|18|17|1|0
866|3|4|6|3|17|3|3|1|0
867|2|3|9|3|6|6|3|1|0
868|2|6|5|3|17|17|17|1|2
869|3|8|1|17|17|3|17|0|0
870|2|8|6|3|3|17|3|1|2
871|3|2|4|3|3|2|3|1|1
872|7|8|7|3|17|17|17|1|0
873|9|2|3|3|3|17|3|1|0
874|3|3|3|3|3|3|3|1|0
875|8|8|3|3|3|17|3|1|0
876|3|4|2|3|1|18|3|1|0
877|3|4|7|17|17|3|3|1|0
878|10|5|9|3|3|17|3|1|1
879|9|2|5|17|6|6|17|1|0
880|0|8|8|3|17|17|17|1|3
881|3|7|4|3|17|18|17|1|2
882|3|3|4|3|17|6|17|1|1
883|3|5|5|3|17|3|3|1|2
884|3|3|5|3|3|3|3|1|0
885|9|4|9|17|3|17|17|-1|1
886|2|8|6|3|17|3|3|1|2
887|6|8|2|17|7|3|17|-1|1
888|3|3|1|17|15|-1|17|-1|0
889|2|6|7|3|17|3|3|1|3
890|3|8|9|3|1|17|3|1|1
891|10|2|0|3|6|-1|3|1|0
892|3|4|4|3|18|18|3|1|2
893|2|8|9|2|17|6|17|1|0
894|3|5|7|3|3|17|3|1|2
895|9|5|3|17|17|6|17|1|0
896|2|5|9|3|3|3|3|1|3
897|3|4|3|3|17|17|3|1|1
898|2|11|6|3|6|18|3|1|0
899|3|4|5|17|6|6|17|1|1
900|4|10|1|3|3|17|3|1|0
901|3|2|9|17|18|17|17|-1|1
902|9|1|9|2|3|6|2|1|0
903|2|5|2|3|3|4|3|1|1
904|7|8|6|17|17|17|17|-1|0
905|2|4|3|3|17|17|3|1|0
906|3|5|7|3|3|3|3|1|0
907|8|4|8|3|17|3|3|1|1
908|9|5|6|3|17|6|3|1|0
909|10|5|5|3|16|-1|3|1|0
910|2|0|2|3|3|6|3|1|0
911|9|5|5|17|18|17|17|0|0
912|4|4|0|3|2|15|3|1|0
913|2|8|7|3|3|18|3|1|1
914|9|4|0|15|17|17|17|-1|0
915|4|1|6|3|3|3|3|1|0
916|2|3|9|3|17|6|3|1|3
917|8|8|2|3|18|6|3|1|0
918|3|3|7|3|17|17|3|1|1
919|2|4|1|3|17|3|3|1|2
920|9|1|9|3|3|2|3|1|0
921|8|8|9|17|18|17|17|1|1
922|8|2|2|17|17|3|17|1|1
923|2|8|9|3|6|17|3|1|0
924|2|4|1|3|3|6|3|1|0
925|7|7|4|3|1|1|1|1|0
926|3|1|0|3|3|5|3|1|0
927|2|6|5|17|17|17|17|-1|1
928|2|8|5|3|5|-1|3|1|0
929|3|3|5|2|3|2|2|1|0
930|8|3|0|3|17|17|17|1|0
931|4|5|3|3|17|2|3|1|0
932|4|5|0|3|3|7|3|1|2
933|2|8|4|3|3|17|17|1|1
934|4|3|2|3|3|17|3|1|1
935|3|0|6|3|18|3|3|1|0
936|2|4|3|3|17|3|3|1|1
937|3|5|9|3|3|17|3|1|0
938|9|6|5|3|6|17|17|1|1
939|8|8|3|17|3|7|17|1|0
940|3|2|0|3|3|17|3|1|1
941|2|8|9|12|4|7|6|1|0
942|9|5|7|3|3|17|3|1|0
943|2|8|7|3|17|17|3|1|1
