{
    "composantName": "item",
    "tag": "li",
    "childs": [
        {
            "tag": "div",
            "class": "item",
            "childs":[
                {
                    "tag": "p",
                    "bind-content": "text"
                },
                {
                    "tag": "input",
                    "input-type": "checkbox",
                    "class": "toggle-input",
                    "bind-click": "toggleChange",
                    "bind-event": "change"
                },
                {
                    "tag": "button",
                    "content":"supprimer",
                    "bind-click": "removeTodoItem"
                }
            ]
        }
    ]
}