<svg width="25" height="25" viewBox="0 0 25 25" fill="none" xmlns="http://www.w3.org/2000/svg">
<path d="M12.554 3.40747C7.68761 3.40747 3.72876 7.41286 3.72876 12.3364C3.72876 17.26 7.68761 21.2654 12.554 21.2654C15.5325 21.2654 18.1727 19.7683 19.7709 17.475L18.5758 16.6149C17.8974 17.5931 16.9958 18.3913 15.9474 18.9418C14.8992 19.4924 13.7351 19.779 12.554 19.7773C8.48335 19.7773 5.19963 16.4549 5.19963 12.3364C5.19963 8.21795 8.48335 4.89564 12.554 4.89564C13.735 4.89424 14.899 5.18094 15.9473 5.73143C16.9955 6.28192 17.8971 7.07998 18.5758 8.05797L19.7709 7.19782C18.9569 6.0263 17.8763 5.07026 16.6201 4.41052C15.364 3.75078 13.9693 3.40674 12.554 3.40747ZM17.955 8.82511L16.8974 9.89511L18.5758 11.5924H9.61227V13.0805H18.5758L16.8974 14.7778L17.955 15.8478L20.8968 12.8714L21.4013 12.3364L20.896 11.8014L17.955 8.82511Z" fill="#7E4532"/>
</svg>
