<svg width="23" height="23" viewBox="0 0 23 23" fill="none" xmlns="http://www.w3.org/2000/svg">
<g clip-path="url(#clip0_344_120)">
<path d="M21.2924 20.042H8.9315C8.54522 20.042 8.21975 19.9059 7.95508 19.6338C7.6904 19.3617 7.55807 19.0358 7.55807 18.6562C7.55807 18.2767 7.6904 17.9544 7.95508 17.6895C8.21975 17.4245 8.54522 17.292 8.9315 17.292H21.2924C21.6786 17.292 22.0041 17.4245 22.2688 17.6895C22.5335 17.9544 22.6658 18.2767 22.6658 18.6562C22.6658 19.0358 22.5299 19.3617 22.2581 19.6338C21.9862 19.9059 21.6643 20.042 21.2924 20.042ZM21.9791 14.542H8.24478C8.0588 14.542 7.89785 14.474 7.76194 14.3379C7.62602 14.2018 7.55807 14.0407 7.55807 13.8545C7.55807 13.6683 7.62602 13.5072 7.76194 13.3711C7.89785 13.235 8.0588 13.167 8.24478 13.167H21.9791C22.1651 13.167 22.326 13.235 22.4619 13.3711C22.5978 13.5072 22.6658 13.6683 22.6658 13.8545C22.6658 14.0407 22.5978 14.2018 22.4619 14.3379C22.326 14.474 22.1651 14.542 21.9791 14.542ZM21.2924 11.792H8.9315C8.54522 11.792 8.21975 11.6595 7.95508 11.3945C7.6904 11.1296 7.55807 10.8037 7.55807 10.417C7.55807 10.0303 7.6904 9.70443 7.95508 9.43945C8.21975 9.17448 8.54522 9.04199 8.9315 9.04199H21.2924C21.6786 9.04199 22.0041 9.17806 22.2688 9.4502C22.5335 9.72233 22.6658 10.0482 22.6658 10.4277C22.6658 10.8073 22.5299 11.1296 22.2581 11.3945C21.9862 11.6595 21.6643 11.792 21.2924 11.792ZM21.9791 6.29199H8.24478C8.0588 6.29199 7.89785 6.22396 7.76194 6.08789C7.62602 5.95182 7.55807 5.79069 7.55807 5.60449C7.55807 5.41829 7.62602 5.25716 7.76194 5.12109C7.89785 4.98503 8.0588 4.91699 8.24478 4.91699H21.9791C22.1651 4.91699 22.326 4.98503 22.4619 5.12109C22.5978 5.25716 22.6658 5.41829 22.6658 5.60449C22.6658 5.79069 22.5978 5.95182 22.4619 6.08789C22.326 6.22396 22.1651 6.29199 21.9791 6.29199ZM21.2924 3.54199H8.9315C8.54522 3.54199 8.21975 3.40951 7.95508 3.14453C7.6904 2.87956 7.55807 2.55371 7.55807 2.16699C7.55807 1.78027 7.6904 1.45443 7.95508 1.18945C8.21975 0.924479 8.54522 0.791992 8.9315 0.791992H21.2924C21.6786 0.791992 22.0041 0.924479 22.2688 1.18945C22.5335 1.45443 22.6658 1.78027 22.6658 2.16699C22.6658 2.55371 22.5299 2.87956 22.2581 3.14453C21.9862 3.40951 21.6643 3.54199 21.2924 3.54199ZM4.81121 22.792H2.06435C1.67807 22.792 1.3526 22.6595 1.08793 22.3945C0.823254 22.1296 0.690918 21.8037 0.690918 21.417V18.667C0.690918 18.2803 0.823254 17.9544 1.08793 17.6895C1.3526 17.4245 1.67807 17.292 2.06435 17.292H4.81121C5.19749 17.292 5.52296 17.4245 5.78763 17.6895C6.0523 17.9544 6.18464 18.2803 6.18464 18.667V21.417C6.18464 21.8037 6.0523 22.1296 5.78763 22.3945C5.52296 22.6595 5.19749 22.792 4.81121 22.792ZM4.81121 14.542H2.06435C1.67807 14.542 1.3526 14.4059 1.08793 14.1338C0.823254 13.8617 0.690918 13.5394 0.690918 13.167V10.417C0.690918 10.0303 0.823254 9.70443 1.08793 9.43945C1.3526 9.17448 1.67807 9.04199 2.06435 9.04199H4.81121C5.18318 9.04199 5.50508 9.17806 5.7769 9.4502C6.04873 9.72233 6.18464 10.0446 6.18464 10.417V13.167C6.18464 13.5537 6.0523 13.8796 5.78763 14.1445C5.52296 14.4095 5.19749 14.542 4.81121 14.542ZM4.81121 6.29199H2.06435C1.67807 6.29199 1.3526 6.15951 1.08793 5.89453C0.823254 5.62956 0.690918 5.30371 0.690918 4.91699V2.16699C0.690918 1.7946 0.823254 1.47233 1.08793 1.2002C1.3526 0.92806 1.67807 0.791992 2.06435 0.791992H4.81121C5.19749 0.791992 5.52296 0.92806 5.78763 1.2002C6.0523 1.47233 6.18464 1.7946 6.18464 2.16699V4.91699C6.18464 5.30371 6.04873 5.62956 5.7769 5.89453C5.50508 6.15951 5.18318 6.29199 4.81121 6.29199ZM8.24478 21.417H21.9791C22.1651 21.417 22.326 21.485 22.4619 21.6211C22.5978 21.7572 22.6658 21.9183 22.6658 22.1045C22.6658 22.2907 22.5978 22.4518 22.4619 22.5879C22.326 22.724 22.1651 22.792 21.9791 22.792H8.24478C8.0588 22.792 7.89785 22.724 7.76194 22.5879C7.62602 22.4518 7.55807 22.2907 7.55807 22.1045C7.55807 21.9183 7.62602 21.7572 7.76194 21.6211C7.89785 21.485 8.0588 21.417 8.24478 21.417Z" fill="#7E4532"/>
</g>
<defs>
<clipPath id="clip0_344_120">
<rect x="0.685303" y="0.791992" width="22" height="22" rx="10" fill="white"/>
</clipPath>
</defs>
</svg>
