<svg width="40" height="40" viewBox="0 0 40 40" fill="none" xmlns="http://www.w3.org/2000/svg">
<path d="M28.3331 29.9998H11.6665V9.99984H28.3331V11.6665H31.6665V4.99984C31.6665 3.1665 30.1665 1.6665 28.3331 1.6665L11.6665 1.68317C9.83313 1.68317 8.33313 3.1665 8.33313 4.99984V34.9998C8.33313 36.8332 9.83313 38.3332 11.6665 38.3332H28.3331C30.1665 38.3332 31.6665 36.8332 31.6665 34.9998V28.3332H28.3331V29.9998ZM34.9998 19.9998C34.9998 19.7832 34.9665 19.5665 34.9331 19.3498L35.9998 18.5498C36.3331 18.2998 36.4331 17.8165 36.2165 17.4498L35.2665 15.8498C35.1637 15.6786 35.0024 15.5505 34.8124 15.4892C34.6223 15.4279 34.4165 15.4376 34.2331 15.5165L33.0331 16.0165C32.6998 15.7665 32.3331 15.5332 31.9498 15.3665L31.7831 14.0832C31.7573 13.8834 31.6606 13.6996 31.5108 13.5651C31.3609 13.4305 31.1678 13.3541 30.9665 13.3498L29.0998 13.3165C28.6665 13.3165 28.3165 13.6165 28.2665 14.0498L28.0998 15.3665C27.6998 15.5332 27.3498 15.7498 27.0165 16.0165L25.8165 15.5165C25.4331 15.3498 24.9831 15.4998 24.7831 15.8498L23.8331 17.4498C23.6165 17.8165 23.6998 18.2832 24.0498 18.5498L25.1165 19.3498C25.0331 19.5665 24.9998 19.7832 24.9998 19.9998C24.9998 20.2165 25.0331 20.4165 25.0665 20.6165L23.9998 21.4332C23.6665 21.6832 23.5665 22.1498 23.7831 22.5165L24.7165 24.1332C24.9331 24.4998 25.3665 24.6498 25.7665 24.4832L26.9831 23.9665C27.3165 24.2332 27.6831 24.4665 28.0998 24.6332L28.2665 25.9165C28.3165 26.3332 28.6665 26.6498 29.0998 26.6498H30.9665C31.3831 26.6498 31.7331 26.3332 31.7998 25.9165L31.9665 24.6332C32.3665 24.4665 32.7331 24.2332 33.0831 23.9665L34.2998 24.4832C34.6831 24.6498 35.1331 24.4998 35.3498 24.1332L36.2831 22.5165C36.4998 22.1498 36.3998 21.6832 36.0665 21.4332L34.9998 20.6165C34.9665 20.4165 34.9998 20.2165 34.9998 19.9998ZM29.9998 22.4998C28.6165 22.4998 27.4998 21.3832 27.4998 19.9998C27.4998 18.6165 28.6165 17.4998 29.9998 17.4998C31.3831 17.4998 32.4998 18.6165 32.4998 19.9998C32.4998 21.3832 31.3831 22.4998 29.9998 22.4998Z" fill="#7E4532"/>
</svg>
