<svg xmlns="http://www.w3.org/2000/svg" width="25" height="25" viewBox="0 0 25 25">
  <path id="Path_14" data-name="Path 14" d="M18.75,21.875a5.62,5.62,0,0,0-3.418.94A2.7,2.7,0,0,0,14.063,25H10.938a2.7,2.7,0,0,0-1.27-2.185,5.62,5.62,0,0,0-3.418-.94,3.743,3.743,0,0,0-1.6.513,6.19,6.19,0,0,0-1.526,1.05L0,20.313a8.922,8.922,0,0,0,3.21-3.174A8.415,8.415,0,0,0,4.688,12.5,8,8,0,0,0,1.563,6.25L3.125,3.125q.171.171.476.427a7.206,7.206,0,0,0,1.135.7,3.284,3.284,0,0,0,1.514.439,4.471,4.471,0,0,0,2.539-.732,4.631,4.631,0,0,0,1.624-1.782A4.8,4.8,0,0,0,10.938,0h3.125a4.8,4.8,0,0,0,.525,2.173,4.631,4.631,0,0,0,1.623,1.782,4.471,4.471,0,0,0,2.539.732A3.293,3.293,0,0,0,20.215,4.3a5.669,5.669,0,0,0,1.221-.781l.439-.391L23.438,6.25a8,8,0,0,0-3.125,6.25,8.414,8.414,0,0,0,1.477,4.639A8.922,8.922,0,0,0,25,20.313l-3.125,3.125a6.546,6.546,0,0,0-1.562-1.086A3.593,3.593,0,0,0,18.75,21.875Z" fill="#5f3e2d"/>
</svg>
