
digraph D {
  THB [shape=diamond label="The Honor Board"]
  ENF [shape=diamond label="Enforcement"]
  EVL [shape=diamond label="Evaluation"]
  MEM [shape=diamond label="Memory"]

  SJ [shape=record label="{Student Jury|{???|???|???|???|???|???|???|???|???|???|???|???}}"]
  TSO [shape=record label="{Traffic Stop Officers|{Mr. Right Turn On Red|Mr. Illegal U-Turn}}"]
  CH [shape=record label="{Chairman|???}"]
  BM [shape=record label="{Board Members|{???|???|???|???|???|???}}"]

  THB -> {ENF, EVL, MEM} [style=dashed, color=grey, label="haha" ]
  ENF -> {SJ, TSO} [style=dashed, color=grey]
  EVL -> {CH, BM} [style=dashed, color=grey]
}
