<svg xmlns="http://www.w3.org/2000/svg" width="40" height="40" viewBox="0 0 40 40">
  <g id="Group_39" data-name="Group 39" transform="translate(-1290 -324)">
    <circle id="Ellipse_17" data-name="Ellipse 17" cx="20" cy="20" r="20" transform="translate(1290 324)" fill="currentColor"/>
    <path id="Path_59" data-name="Path 59" d="M7.509,17.278,1,10.311a2.373,2.373,0,1,1,3.468-3.24l5.021,5.374,7.947-7.425a2.379,2.379,0,0,1,.223-.184L21.4,1.343a2.373,2.373,0,0,1,3.24,3.468L13.222,15.476l-.012-.013L9.261,19.152,7.509,17.277Z" transform="translate(1296.636 335.185)" fill="#fff" fill-rule="evenodd"/>
  </g>
</svg>
