<svg xmlns="http://www.w3.org/2000/svg" width="40" height="40" viewBox="0 0 40 40">
  <g id="Group_64" data-name="Group 64" transform="translate(-1290 -182)">
    <g id="Group_41" data-name="Group 41">
      <circle id="Ellipse_15" data-name="Ellipse 15" cx="20" cy="20" r="20" transform="translate(1290 182)" fill="currentColor"/>
      <path id="clock" d="M11.167,0A11.167,11.167,0,1,0,22.333,11.167,11.179,11.179,0,0,0,11.167,0Zm5.311,16.942a.93.93,0,0,1-1.316,0L10.509,12.29a.926.926,0,0,1-.273-.658V5.583a.93.93,0,1,1,1.861,0v5.663l4.38,4.38a.93.93,0,0,1,0,1.316Zm0,0" transform="translate(1298.833 190.833)" fill="#fff"/>
    </g>
  </g>
</svg>
