{
	"info": {
		"_postman_id": "ff69959d-6e8b-41cb-88ee-49278e057729",
		"name": "SweetKekkiApi",
		"schema": "https://schema.getpostman.com/json/collection/v2.1.0/collection.json",
		"_exporter_id": "27689114"
	},
	"item": [
		{
			"name": "POST userRegistration",
			"request": {
				"method": "POST",
				"header": [],
				"body": {
					"mode": "raw",
					"raw": "{\r\n    \"firstName\": \"Cross\",\r\n    \"lastName\": \"Ssorc\",\r\n    \"email\": \"cross@gmail.com\",\r\n    \"password\": \"drowssap\",\r\n    \"mobileNo\": \"09123456789\"\r\n}",
					"options": {
						"raw": {
							"language": "json"
						}
					}
				},
				"url": {
					"raw": "localhost:4001/user/register",
					"host": [
						"localhost"
					],
					"port": "4001",
					"path": [
						"user",
						"register"
					]
				}
			},
			"response": []
		},
		{
			"name": "GET userlogin",
			"protocolProfileBehavior": {
				"disableBodyPruning": true
			},
			"request": {
				"method": "GET",
				"header": [],
				"body": {
					"mode": "raw",
					"raw": "{\r\n    \"email\": \"cross@gmail.com\",\r\n    \"password\": \"drowssap\"\r\n}",
					"options": {
						"raw": {
							"language": "json"
						}
					}
				},
				"url": {
					"raw": "localhost:4001/user/login",
					"host": [
						"localhost"
					],
					"port": "4001",
					"path": [
						"user",
						"login"
					]
				}
			},
			"response": []
		},
		{
			"name": "POST newProducts",
			"request": {
				"auth": {
					"type": "bearer",
					"bearer": [
						{
							"key": "token",
							"value": "eyJhbGciOiJIUzI1NiIsInR5cCI6IkpXVCJ9.eyJpZCI6IjY0N2RjZjFmOGNkZjBmOGM2NjE1YTk1YyIsImlzQWRtaW4iOnRydWUsImVtYWlsIjoia3Vyb3N1QGdtYWlsLmNvbSIsImlhdCI6MTY4NTk3MDkzOH0.4CcHW-OCgVu7mTVCXA2F6SGSyaVms5qJLDn7vqwOcZs",
							"type": "string"
						}
					]
				},
				"method": "POST",
				"header": [],
				"body": {
					"mode": "raw",
					"raw": "{\r\n    \"name\": \"ramen\",\r\n    \"description\": \"food\",\r\n    \"price\": 90,\r\n    \"isActive\": \"false\"\r\n}",
					"options": {
						"raw": {
							"language": "json"
						}
					}
				},
				"url": {
					"raw": "localhost:4001/products/addProduct",
					"host": [
						"localhost"
					],
					"port": "4001",
					"path": [
						"products",
						"addProduct"
					]
				}
			},
			"response": []
		},
		{
			"name": "GET getallProducts (admin only)",
			"request": {
				"auth": {
					"type": "bearer",
					"bearer": [
						{
							"key": "token",
							"value": "eyJhbGciOiJIUzI1NiIsInR5cCI6IkpXVCJ9.eyJpZCI6IjY0N2RjZjFmOGNkZjBmOGM2NjE1YTk1YyIsImlzQWRtaW4iOnRydWUsImVtYWlsIjoia3Vyb3N1QGdtYWlsLmNvbSIsImlhdCI6MTY4NTk3MDkzOH0.4CcHW-OCgVu7mTVCXA2F6SGSyaVms5qJLDn7vqwOcZs",
							"type": "string"
						}
					]
				},
				"method": "GET",
				"header": [],
				"url": {
					"raw": "localhost:4001/products/",
					"host": [
						"localhost"
					],
					"port": "4001",
					"path": [
						"products",
						""
					]
				}
			},
			"response": []
		},
		{
			"name": "GET getAllActiveProducts",
			"protocolProfileBehavior": {
				"disableBodyPruning": true
			},
			"request": {
				"method": "GET",
				"header": [],
				"body": {
					"mode": "raw",
					"raw": ""
				},
				"url": {
					"raw": "localhost:4001/products/activeProducts",
					"host": [
						"localhost"
					],
					"port": "4001",
					"path": [
						"products",
						"activeProducts"
					]
				}
			},
			"response": []
		},
		{
			"name": "GET getProduct",
			"protocolProfileBehavior": {
				"disableBodyPruning": true
			},
			"request": {
				"auth": {
					"type": "bearer",
					"bearer": [
						{
							"key": "token",
							"value": "eyJhbGciOiJIUzI1NiIsInR5cCI6IkpXVCJ9.eyJpZCI6IjY0N2RjZjFmOGNkZjBmOGM2NjE1YTk1YyIsImlzQWRtaW4iOnRydWUsImVtYWlsIjoia3Vyb3N1QGdtYWlsLmNvbSIsImlhdCI6MTY4NTk3MDkzOH0.4CcHW-OCgVu7mTVCXA2F6SGSyaVms5qJLDn7vqwOcZs",
							"type": "string"
						}
					]
				},
				"method": "GET",
				"header": [],
				"body": {
					"mode": "raw",
					"raw": "",
					"options": {
						"raw": {
							"language": "json"
						}
					}
				},
				"url": {
					"raw": "localhost:4001/products/647de06b8802dea309e42c6b",
					"host": [
						"localhost"
					],
					"port": "4001",
					"path": [
						"products",
						"647de06b8802dea309e42c6b"
					]
				}
			},
			"response": []
		},
		{
			"name": "PATCH updateProduct",
			"request": {
				"auth": {
					"type": "bearer",
					"bearer": [
						{
							"key": "token",
							"value": "eyJhbGciOiJIUzI1NiIsInR5cCI6IkpXVCJ9.eyJpZCI6IjY0N2RjZjFmOGNkZjBmOGM2NjE1YTk1YyIsImlzQWRtaW4iOnRydWUsImVtYWlsIjoia3Vyb3N1QGdtYWlsLmNvbSIsImlhdCI6MTY4NjAxNDI1OH0.MEo-hB-o9bVhM40wGHSInw5SFPKEORgsv2PiNnLbXZg",
							"type": "string"
						}
					]
				},
				"method": "PATCH",
				"header": [],
				"body": {
					"mode": "raw",
					"raw": "{\r\n    \"name\": \"kapukekki\",\r\n    \"description\": \"food\",\r\n    \"price\": 50\r\n}",
					"options": {
						"raw": {
							"language": "json"
						}
					}
				},
				"url": {
					"raw": "localhost:4001/products/647de06b8802dea309e42c6b",
					"host": [
						"localhost"
					],
					"port": "4001",
					"path": [
						"products",
						"647de06b8802dea309e42c6b"
					]
				}
			},
			"response": []
		},
		{
			"name": "PATCH archiveProduct",
			"request": {
				"auth": {
					"type": "bearer",
					"bearer": [
						{
							"key": "token",
							"value": "eyJhbGciOiJIUzI1NiIsInR5cCI6IkpXVCJ9.eyJpZCI6IjY0N2RjZjFmOGNkZjBmOGM2NjE1YTk1YyIsImlzQWRtaW4iOnRydWUsImVtYWlsIjoia3Vyb3N1QGdtYWlsLmNvbSIsImlhdCI6MTY4NjAxNDI1OH0.MEo-hB-o9bVhM40wGHSInw5SFPKEORgsv2PiNnLbXZg",
							"type": "string"
						}
					]
				},
				"method": "PATCH",
				"header": [],
				"body": {
					"mode": "raw",
					"raw": "{\r\n    \"isActive\": true\r\n}",
					"options": {
						"raw": {
							"language": "json"
						}
					}
				},
				"url": {
					"raw": "localhost:4001/products/647de06b8802dea309e42c6b/archive",
					"host": [
						"localhost"
					],
					"port": "4001",
					"path": [
						"products",
						"647de06b8802dea309e42c6b",
						"archive"
					]
				}
			},
			"response": []
		},
		{
			"name": "POST create orders",
			"request": {
				"auth": {
					"type": "bearer",
					"bearer": [
						{
							"key": "token",
							"value": "eyJhbGciOiJIUzI1NiIsInR5cCI6IkpXVCJ9.eyJpZCI6IjY0N2U3ZDUwNjRkNjA4OWRmMWI1ODNjNiIsImlzQWRtaW4iOmZhbHNlLCJlbWFpbCI6ImNyb3NzQGdtYWlsLmNvbSIsImlhdCI6MTY4NjAzNDYzNH0.bIiwHIqWuON23EaHQlffCvMQFkZQm_t_9rvM7CXMKoc",
							"type": "string"
						}
					]
				},
				"method": "POST",
				"header": [],
				"body": {
					"mode": "formdata",
					"formdata": []
				},
				"url": {
					"raw": "localhost:4001/orders/createOrder",
					"host": [
						"localhost"
					],
					"port": "4001",
					"path": [
						"orders",
						"createOrder"
					]
				}
			},
			"response": []
		},
		{
			"name": "GET getProfile",
			"protocolProfileBehavior": {
				"disableBodyPruning": true
			},
			"request": {
				"auth": {
					"type": "bearer",
					"bearer": [
						{
							"key": "token",
							"value": "eyJhbGciOiJIUzI1NiIsInR5cCI6IkpXVCJ9.eyJpZCI6IjY0N2RjZjFmOGNkZjBmOGM2NjE1YTk1YyIsImlzQWRtaW4iOnRydWUsImVtYWlsIjoia3Vyb3N1QGdtYWlsLmNvbSIsImlhdCI6MTY4NjA0MTAyNn0.kDxWicHaBzTATSwKvCdknFTZYb5CLP6a8o9pFFHY038",
							"type": "string"
						}
					]
				},
				"method": "GET",
				"header": [],
				"body": {
					"mode": "raw",
					"raw": "{\r\n    \"id\": \"647e7d5064d6089df1b583c6\"\r\n}",
					"options": {
						"raw": {
							"language": "json"
						}
					}
				},
				"url": {
					"raw": "localhost:4001/user/details",
					"host": [
						"localhost"
					],
					"port": "4001",
					"path": [
						"user",
						"details"
					]
				}
			},
			"response": []
		}
	]
}