{
  "project_info": {
    "project_number": "962679591332",
    "project_id": "demoproject-edf5c",
    "storage_bucket": "demoproject-edf5c.appspot.com"
  },
  "client": [
    {
      "client_info": {
        "mobilesdk_app_id": "1:962679591332:android:2c56499ca007a57d0f7131",
        "android_client_info": {
          "package_name": "com.example.demo"
        }
      },
      "oauth_client": [
        {
          "client_id": "962679591332-pvdd5g1pret4plifsc7qhr0qos32mpf4.apps.googleusercontent.com",
          "client_type": 3
        }
      ],
      "api_key": [
        {
          "current_key": "AIzaSyDS3Jv09CYMTn-5R4k7-IFcxWcSN6nJei8"
        }
      ],
      "services": {
        "appinvite_service": {
          "other_platform_oauth_client": [
            {
              "client_id": "962679591332-pvdd5g1pret4plifsc7qhr0qos32mpf4.apps.googleusercontent.com",
              "client_type": 3
            }
          ]
        }
      }
    }
  ],
  "configuration_version": "1"
}