<svg width="12" height="12" viewBox="0 0 12 12" fill="none" xmlns="http://www.w3.org/2000/svg">
<path d="M5.0316 3.0848C5.44197 2.02827 5.64716 1.5 6 1.5C6.35284 1.5 6.55803 2.02827 6.9684 3.0848L6.98751 3.134C7.21935 3.73089 7.33528 4.02933 7.57153 4.21073C7.80778 4.39213 8.11791 4.42081 8.73818 4.47818L8.85031 4.48855C9.86545 4.58244 10.373 4.62938 10.4816 4.96287C10.5902 5.29636 10.2133 5.65052 9.45941 6.35884L9.2078 6.59524C8.82617 6.9538 8.63535 7.13308 8.54642 7.36806C8.52983 7.41189 8.51603 7.4568 8.50513 7.50249C8.44667 7.74745 8.50255 8.00753 8.6143 8.5277L8.64909 8.68961C8.85447 9.64558 8.95716 10.1236 8.77786 10.3297C8.71086 10.4068 8.62378 10.4622 8.52705 10.4895C8.26818 10.5624 7.90065 10.2532 7.16559 9.6346C6.68293 9.22843 6.44159 9.02534 6.16452 8.97966C6.05553 8.96168 5.94447 8.96168 5.83548 8.97966C5.5584 9.02534 5.31707 9.22843 4.83441 9.6346C4.09935 10.2532 3.73182 10.5624 3.47295 10.4895C3.37622 10.4622 3.28914 10.4068 3.22214 10.3297C3.04284 10.1236 3.14553 9.64558 3.35092 8.68961L3.3857 8.5277C3.49745 8.00753 3.55333 7.74745 3.49487 7.50249C3.48397 7.4568 3.47017 7.41189 3.45358 7.36806C3.36465 7.13308 3.17383 6.9538 2.7922 6.59524L2.54059 6.35884C1.78671 5.65052 1.40977 5.29636 1.51837 4.96287C1.62698 4.62938 2.13455 4.58244 3.14969 4.48855L3.26182 4.47818C3.88209 4.42081 4.19222 4.39213 4.42847 4.21073C4.66472 4.02933 4.78065 3.73089 5.01249 3.134L5.0316 3.0848Z" fill="#5EBD62"/>
</svg>
