<svg width="24" height="24" viewBox="0 0 24 24" fill="none" xmlns="http://www.w3.org/2000/svg">
<circle cx="11" cy="11" r="7" stroke="#8B8B8B" stroke-width="1.5"/>
<path d="M20 20L16 16" stroke="#8B8B8B" stroke-width="1.5" stroke-linecap="round"/>
</svg>
