{
  "migIndex": 1,
  "data": [
    {
      "path": "assets/fonts/Inter-Bold.ttf",
      "sha1": "47ff07c75746682133b81e7ac0537ce50a4c9916"
    },
    {
      "path": "assets/fonts/Inter-Medium.ttf",
      "sha1": "e76f580811e031813e7150131a0724811cdd737a"
    },
    {
      "path": "assets/fonts/Inter-Regular.ttf",
      "sha1": "cfa780d0b50b2bb7eacb82984f1b18a95aaa40c5"
    },
    {
      "path": "assets/fonts/Inter-SemiBold.ttf",
      "sha1": "5e0c44e57e7e090252d79f622899e67585bb892c"
    },
    {
      "path": "assets/fonts/MPLUSRounded1c-Bold.ttf",
      "sha1": "a0fef8f5726fb43db9fbfe51fa1802f075464dd1"
    }
  ]
}
