<svg width="16" height="16" viewBox="0 0 16 16" fill="none" xmlns="http://www.w3.org/2000/svg">
<path d="M2.96708 9.27222L7.60215 13.6264C7.65399 13.6751 7.67991 13.6994 7.7046 13.7175C7.88046 13.8463 8.11946 13.8463 8.29532 13.7175C8.32 13.6994 8.34592 13.6751 8.39777 13.6264L13.0328 9.27222C14.337 8.04714 14.4953 6.03115 13.3985 4.61746L13.1923 4.35164C11.8801 2.66047 9.24638 2.94409 8.3244 4.87585C8.19417 5.14872 7.80575 5.14872 7.67551 4.87585C6.75354 2.94409 4.11977 2.66047 2.80766 4.35164L2.60142 4.61746C1.50459 6.03115 1.66296 8.04714 2.96708 9.27222Z" fill="#FF3B65"/>
</svg>
