{
  "files": {
    "main.css": "/static/css/main.ec2e7d8b.css",
    "main.js": "/static/js/main.6ece1fff.js",
    "static/media/belogo.svg": "/static/media/belogo.680f426be6b458f8e26c.svg",
    "index.html": "/index.html",
    "main.ec2e7d8b.css.map": "/static/css/main.ec2e7d8b.css.map",
    "main.6ece1fff.js.map": "/static/js/main.6ece1fff.js.map"
  },
  "entrypoints": [
    "static/css/main.ec2e7d8b.css",
    "static/js/main.6ece1fff.js"
  ]
}