{
    "university": "King Abdulaziz University",
    "college": "Faculty of Computing and Information Technology",
    "department": "Department of Information Technology",
    "name": "CPIT-490 Systems and Cloud Administration",
    "course": "CPIT-490",
    "semester": "Fall 2018",
    "description": "This course is a survey of system adminstration and cloud computing where we introduce a varaitey of topics related to the management of production environments. This course takes a hands-on approach and promotes learning by doing in new and exciting ways.",
    "lecture": {
        "time": "Sunday, Tuesday, Thursday 2:00-2:50PM",
        "location": "FCIT building, Lab 14"
    },
    "lab": {
        "time": "Sunday 5:30-6:50PM",
        "location": "FCIT building, lab 3"
    },
    "instructor": {
        "name": "Khalid Alharbi, Ph.D",
        "officeHours":"Sunday, Tuesday, Thursday 11:00AM-01:00PM",
        "officeLocation": "FCIT building, office: 112"
    },
    "slack": "https://cpit-490-fall-18.slack.com",
    "slackInvite": "http://bit.ly/cpit-490-fall-18",
    "gitlab": "https://gitlab.com/cpit490",
    "gitlabRepo": "https://gitlab.com/cpit490/cpit490.gitlab.io"
}