{
  "kind": "collectionType",
  "collectionName": "boards",
  "info": {
    "singularName": "board",
    "pluralName": "boards",
    "displayName": "board",
    "description": ""
  },
  "options": {
    "draftAndPublish": true
  },
  "pluginOptions": {},
  "attributes": {
    "Name": {
      "type": "string",
      "required": true,
      "unique": true
    },
    "columns": {
      "type": "relation",
      "relation": "oneToMany",
      "target": "api::column.column"
    }
  }
}
