-------------------------------------------------------------------------------
Test set: com.journey.core.CommuterTest
-------------------------------------------------------------------------------
Tests run: 2, Failures: 0, Errors: 0, Skipped: 0, Time elapsed: 0.055 sec
