Merge branch 'kriging' of gitlab.com:Molcas/OpenMolcas into kriging

12 jobs for kriging in 91 minutes and 14 seconds (queued for 6 seconds)
Status Job ID Name Coverage
  Build
passed #217425361
docker
build:bounds

00:18:07

passed #217425363
docker
build:debug

00:10:40

passed #217425359
docker
build:garble

00:17:14

failed #217425355
intel_license
build:intel

00:11:45

failed #217425357
intel13
build:intel13

00:03:11

passed #217425349
docker
build:options

00:16:32

passed #217425351
docker
build:pgi

00:23:28

passed #217425345
docker
build:plain

00:13:26

passed #217425365
docker
build:qcmaquis

00:53:44

passed #217425353
docker
build:sun

01:20:21

passed #217425343
docker
doc

00:07:36

passed #217425344
tinker

00:11:12

 
Name Stage Failure
failed
build:intel13 Build
make: *** [only_objs] Error 2
Und Tschuess
Uploading artifacts...
Runtime platform arch=amd64 os=linux pid=65305 revision=fa86510e version=11.9.2
build/: found 13909 matching files
WARNING: molcas-extra/: no matching files
Uploading artifacts to coordinator... ok id=217425357 responseStatus=201 Created token=UyAJz2b1
Und Tschuess
ERROR: Job failed: exit status 1
failed
build:intel Build
make[3]: *** [CMakeFiles/slapaf_util_obj.dir/build.make:1597: CMakeFiles/slapaf_util_obj.dir/src/slapaf_util/rdctl_slapaf.f.o] Error 1
make[2]: *** [CMakeFiles/Makefile2:4553: CMakeFiles/slapaf_util_obj.dir/all] Error 2
make[1]: *** [CMakeFiles/Makefile2:5117: CMakeFiles/only_objs.dir/rule] Error 2
make: *** [Makefile:1464: only_objs] Error 2
Uploading artifacts...
build/: found 12787 matching files
WARNING: molcas-extra/: no matching files
Uploading artifacts to coordinator... ok id=217425355 responseStatus=201 Created token=Qsyoa7je
ERROR: Job failed: exit code 1