<?xml version="1.0" standalone="no"?>
<!DOCTYPE svg PUBLIC "-//W3C//DTD SVG 1.1//EN" "http://www.w3.org/Graphics/SVG/1.1/DTD/svg11.dtd" >
<svg xmlns="http://www.w3.org/2000/svg">
<metadata>Generated by IcoMoon</metadata>
<defs>
<font id="icomoon" horiz-adv-x="1024">
<font-face units-per-em="1024" ascent="960" descent="-64" />
<missing-glyph horiz-adv-x="1024" />
<glyph unicode="&#x20;" horiz-adv-x="512" d="" />
<glyph unicode="&#xe900;" glyph-name="Group" horiz-adv-x="1497" d="M187.413 900.251h213.603l97.092-525.794c2.987-17.924 11.95-34.355 23.9-46.304 16.431-16.431 38.837-25.391 62.735-25.391h618.405c26.888 0 43.315 26.884 44.812 47.797l89.624 382.395c0 1.493 1.493 4.481 1.493 7.469 0 19.419-13.442 41.824-44.812 41.824h-670.685c-16.431 0-29.873-13.444-29.873-29.875s13.442-29.874 29.873-29.874h649.771l-83.649-358.493h-604.96c-7.467 0-14.935 2.985-19.417 8.96-4.482 4.482-7.471 8.964-7.471 14.939l-101.571 548.197c-2.988 13.444-14.937 23.9-29.875 23.9h-238.996c-16.431 0-29.875-13.444-29.875-29.875s13.444-29.875 29.875-29.875zM401.016 900.251l38.73 7.152-5.952 32.233h-32.778v-39.385zM498.108 374.457l38.849 6.475-0.057 0.343-0.062 0.335-38.73-7.152zM1247.961 350.559l-38.345 8.988-0.717-3.052-0.224-3.127 39.286-2.808zM1337.584 732.954l38.345-8.988 1.040 4.434v4.554h-39.385zM1273.352 722.497l38.357-8.949 11.276 48.334h-49.632v-39.385zM1189.703 364.004v-39.385h31.256l7.101 30.432-38.357 8.952zM565.327 372.964l31.508 23.631-1.682 2.241-1.977 1.977-27.849-27.849zM557.856 387.903h39.385v3.616l-0.658 3.56-38.727-7.176zM456.284 936.1l38.725 7.175-0.127 0.687-0.152 0.682-38.446-8.544zM187.413 860.866h213.603v78.769h-213.603v-78.769zM362.286 893.099l97.093-525.79 77.46 14.301-97.093 525.793-77.46-14.304zM459.26 367.982c4.605-24.292 19.264-51.476 34.899-67.679l55.699 55.698c-8.265 7.696-11.531 13.379-12.9 24.93l-77.698-12.95zM494.159 300.304c24.182-24.182 56.768-36.927 90.585-36.927v78.769c-13.982 0-26.207 5.175-34.886 13.856l-55.699-55.698zM584.743 263.377h618.405v78.769h-618.405v-78.769zM1203.149 263.377c27.861 0 49.085 14.249 62.381 30.468 11.327 14.643 20.161 37.853 21.713 53.91l-78.568 5.612c-0.059-0.859-0.354-2.513-1.166-4.553-0.8-2.009-1.839-3.745-2.887-5.022-1.036-1.268-1.753-1.69-1.859-1.745-0.035-0.020 0.032 0.020 0.181 0.059 0.161 0.039 0.252 0.039 0.205 0.039v-78.769zM1286.305 341.571l89.624 382.395-76.69 17.975-89.624-382.395 76.69-17.975zM1376.969 732.954c0-2.904-0.347-5.141-0.54-6.245-0.213-1.187-0.429-2.041-0.504-2.319-0.079-0.297-0.126-0.454-0.055-0.217 0.063 0.213 0.181 0.625 0.331 1.136 0.299 1.050 0.847 3.025 1.312 5.413 0.461 2.4 0.949 5.749 0.949 9.701h-78.769c0 2.458 0.299 4.314 0.484 5.267 0.181 0.941 0.358 1.516 0.284 1.259-0.039-0.142-0.106-0.36-0.217-0.749-0.118-0.397-0.351-1.219-0.536-1.927-0.213-0.815-0.547-2.171-0.843-3.819-0.276-1.566-0.666-4.223-0.666-7.5h78.769zM1378.462 740.422c-0.477 15.809-8.641 39.866-20.854 54.653-15.36 16.935-37.49 26.556-63.342 26.556v-78.769c3.096 0 4.525-0.537 4.864-0.681 0.315-0.134 0.256-0.158 0.134-0.024-0.063 0.070 0.051-0.030 0.193-0.424 0.158-0.432 0.236-0.926 0.236-1.311h78.769zM1294.265 821.631h-670.685v-78.769h670.685v78.769zM623.581 821.631c-38.183 0-69.258-31.077-69.258-69.259h78.769c0-5.32-4.191-9.51-9.511-9.51v78.769zM554.323 752.372c0-38.183 31.074-69.259 69.258-69.259v78.769c5.321 0 9.511-4.19 9.511-9.51h-78.769zM623.581 683.113h649.771v78.769h-649.771v-78.769zM1234.999 731.447l-83.649-358.494 76.709-17.9 83.649 358.496-76.709 17.899zM1189.703 403.389h-604.96v-78.769h604.96v78.769zM584.743 403.389c2.143 0 7.605-0.815 12.091-6.794l-63.016-47.262c13.446-17.928 33.848-24.714 50.925-24.714v78.769zM593.176 400.813c-0.89 0.89 0.173 0.032 1.414-2.269 1.512-2.808 2.651-6.561 2.651-10.642h-78.767c0-21.465 11.696-35.478 19.004-42.787l55.699 55.698zM596.582 395.079l-101.573 548.197-77.451-14.351 101.573-548.198 77.451 14.352zM494.731 944.644c-6.821 30.695-34.149 54.741-68.321 54.741v-78.769c-4.298 0-7.726 3.133-8.572 6.941l76.893 17.087zM426.409 999.385h-238.996v-78.769h238.996v78.769zM187.413 999.385c-38.183 0-69.259-31.077-69.259-69.259h78.769c0-5.321-4.19-9.51-9.51-9.51v78.769zM118.154 930.125c0-38.182 31.077-69.259 69.259-69.259v78.769c5.321 0 9.51-4.19 9.51-9.51h-78.769zM1103.081 213.15c-68.711 0-123.979-56.762-123.979-126.967s55.268-126.967 123.979-126.967c68.712 0 123.98 56.762 123.98 126.967s-55.268 126.967-123.98 126.967zM1103.081 18.965c-34.356 0-64.23 29.875-64.23 67.218s29.874 67.218 64.23 67.218c34.356 0 64.23-29.874 64.23-67.218s-28.381-67.218-64.23-67.218zM517.514 86.183c0-70.205 55.268-126.967 123.979-126.967s123.98 56.762 123.98 126.967c0 70.205-56.762 126.967-125.473 126.967s-122.486-56.762-122.486-126.967zM704.23 86.183c0-37.343-28.381-67.218-64.23-67.218s-64.23 29.875-64.23 67.218c0 37.343 29.874 67.218 64.23 67.218s64.23-29.874 64.23-67.218z" />
<glyph unicode="&#xe901;" glyph-name="Vector" horiz-adv-x="901" d="M266.102 280.211l-166.919-92.529c-61.688-33.313-99.184-98.701-99.184-170.254v-3.703c0-43.18 33.868-77.726 74.992-77.726h751.134c41.128 0 74.994 34.546 74.994 76.493 0 74.023-41.124 140.644-105.23 173.957l-177.807 91.296c-9.675 4.936-14.512 14.803-14.512 24.674v56.75c3.629 3.703 6.046 8.638 9.675 12.337 22.983 33.313 41.124 69.091 55.64 107.336 29.028 17.273 47.174 49.349 47.174 85.128v76.492c0 20.973-6.050 40.713-18.145 57.985v45.648c3.629 50.583-12.095 101.166-44.753 140.646-43.545 49.349-111.28 75.258-201.994 75.258-90.718 0-158.453-24.675-201.998-75.258-32.658-38.246-48.382-88.829-44.754-139.412v-46.882c-12.095-17.272-18.143-37.012-18.143-57.985v-75.258c0-27.142 10.886-53.049 30.239-71.555 13.305-48.116 33.867-92.533 62.897-133.247v-55.517c0-9.867-4.838-19.739-13.305-24.674zM322.952 383.844c-27.82 38.248-49.592 82.661-61.687 129.544-1.21 4.936-4.838 9.867-8.467 13.57-12.095 9.871-18.143 23.441-18.143 38.246v76.492c0 12.337 4.838 23.441 12.095 32.077 3.629 4.935 6.048 9.87 6.048 16.038v56.752c0 1.234 0 2.467 0 2.467-2.419 37.012 8.467 74.024 32.658 103.634 33.867 38.246 89.507 57.985 165.711 57.985 76.202 0 131.842-19.74 164.499-57.985 24.191-29.61 35.074-66.622 32.657-103.634 0-1.234 0-1.234 0-2.467v-56.752c0-6.169 2.417-12.337 6.046-16.038 7.258-8.636 12.095-20.974 12.095-32.077v-76.492c0-19.741-10.883-37.014-29.028-44.415-6.046-2.466-10.887-8.634-13.304-14.803-12.095-37.016-30.241-72.79-52.011-104.87-4.837-6.169-8.466-12.337-12.095-17.273-3.629-4.932-6.050-9.867-6.050-16.036v-65.389c0-29.61 15.725-55.517 42.336-69.091l179.016-91.296c48.382-24.674 78.619-74.023 78.619-129.54 0-14.807-12.095-27.144-26.608-27.144h-752.346c-14.515 0-26.61 12.337-26.61 27.144v3.699c0 53.051 27.82 101.167 73.783 127.074l166.919 92.533c24.191 13.57 39.916 39.477 39.916 67.854v64.156c-1.21 6.169-2.42 11.104-6.048 16.036z" />
</font></defs></svg>