<?xml version="1.0" encoding="utf-8"?>
<!-- Generator: Adobe Illustrator 24.0.0, SVG Export Plug-In . SVG Version: 6.00 Build 0)  -->
<svg version="1.1" id="Layer_1" xmlns="http://www.w3.org/2000/svg" xmlns:xlink="http://www.w3.org/1999/xlink" x="0px" y="0px"
	 viewBox="0 0 41.1 44.2" style="enable-background:new 0 0 41.1 44.2;" xml:space="preserve">
<style type="text/css">
	.st0{fill:#20201F;}
	.st1{fill:#FDDC18;}
</style>
<title>resto</title>
<g>
	<path class="st0" d="M10.2,5.4L10.2,5.4c4.6,0,8.3,3.7,8.3,8.3l0,0c0,4.6-3.7,8.3-8.3,8.3l0,0c-4.6,0-8.3-3.7-8.3-8.3l0,0
		C1.8,9.2,5.6,5.4,10.2,5.4z"/>
	<path class="st0" d="M10.2,26.3L10.2,26.3c4.6,0,8.3,3.7,8.3,8.3v0c0,4.6-3.7,8.3-8.3,8.3l0,0c-4.6,0-8.3-3.7-8.3-8.3v0
		C1.8,30,5.6,26.3,10.2,26.3z"/>
	<path class="st0" d="M31,1.3L31,1.3c4.6,0,8.3,3.7,8.3,8.3l0,0c0,4.6-3.7,8.3-8.3,8.3l0,0c-4.6,0-8.3-3.7-8.3-8.3l0,0
		C22.6,5,26.4,1.3,31,1.3z"/>
	<path class="st1" d="M31,22.1L31,22.1c4.6,0,8.3,3.7,8.3,8.3l0,0c0,4.6-3.7,8.3-8.3,8.3l0,0c-4.6,0-8.3-3.7-8.3-8.3l0,0
		C22.6,25.8,26.4,22.1,31,22.1z"/>
</g>
<g>
	<path class="st0" d="M206.6,7.8h10.7c2.4-0.1,4.7,0.6,6.6,2.1c1.6,1.6,2.5,3.8,2.4,6.1c0.1,1.7-0.4,3.3-1.3,4.7
		c-0.9,1.3-2.1,2.3-3.6,2.8l4.7,9h-5.5l-4.3-8.4H212v8.4h-5.4V7.8z M216.3,19.7c1.1,0.1,2.3-0.2,3.2-0.9c0.8-0.7,1.3-1.7,1.2-2.8
		c0.1-1.1-0.3-2.2-1.2-2.9c-1-0.6-2.1-0.9-3.3-0.8H212v7.4H216.3z"/>
	<path class="st0" d="M231,7.8h17.2v4.5h-11.8v5.8h8.7v4.3h-8.7v5.7h11.8v4.5H231V7.8z"/>
	<path class="st0" d="M255.6,32.7c-1.3-0.2-2.5-0.6-3.6-1.1v-4.7c1.2,0.6,2.5,1.1,3.9,1.4c1.3,0.3,2.6,0.4,3.9,0.5
		c1.1,0.1,2.2-0.2,3.1-0.7c0.7-0.4,1.1-1.2,1.1-2c0-0.6-0.2-1.1-0.5-1.6c-0.4-0.5-1-0.9-1.5-1.1c-0.7-0.3-1.7-0.8-3.1-1.4
		c-1.9-0.7-3.6-1.8-5-3.2c-1-1.2-1.6-2.7-1.6-4.3c0-1.3,0.4-2.6,1.1-3.7c0.8-1.1,1.9-2,3.2-2.5c1.5-0.6,3.1-0.9,4.7-0.9
		c1.3,0,2.6,0.1,3.9,0.3c1.1,0.2,2.3,0.6,3.3,1.1v4.6c-1.9-1-4.1-1.5-6.2-1.6c-1.1-0.1-2.2,0.2-3.1,0.7c-0.7,0.4-1.2,1.2-1.1,2
		c0,0.6,0.2,1.1,0.5,1.5c0.4,0.4,0.9,0.8,1.5,1.1c0.7,0.3,1.7,0.8,3.1,1.4c1.4,0.5,2.7,1.2,3.9,2c0.9,0.6,1.6,1.4,2.1,2.3
		c0.5,1,0.7,2.1,0.7,3.3c0.1,2-0.8,4-2.4,5.2c-1.6,1.2-4.1,1.9-7.3,1.9C258.6,33.1,257.1,32.9,255.6,32.7z"/>
	<path class="st0" d="M279.5,12.3h-7.2V7.8h19.8v4.5h-7.2v20.2h-5.4V12.3z"/>
	<path class="st0" d="M300.6,31.5c-2-1-3.6-2.6-4.8-4.6c-1.2-2-1.8-4.4-1.7-6.7c0-2.4,0.5-4.7,1.7-6.7c1.1-1.9,2.8-3.5,4.8-4.6
		c4.2-2.2,9.2-2.2,13.4,0c2,1.1,3.6,2.6,4.7,4.6c1.2,2,1.8,4.4,1.7,6.7c0,2.3-0.6,4.7-1.7,6.7c-1.1,1.9-2.8,3.5-4.7,4.5
		C309.8,33.6,304.8,33.6,300.6,31.5L300.6,31.5z M311.3,27.2c1.2-0.6,2.1-1.6,2.8-2.8c0.7-1.3,1-2.7,1-4.2c0-1.4-0.3-2.9-1-4.2
		c-0.6-1.2-1.6-2.1-2.8-2.8c-1.2-0.7-2.5-1-3.9-1c-1.4,0-2.7,0.3-3.9,1c-1.2,0.7-2.1,1.6-2.8,2.8c-0.7,1.3-1,2.7-1,4.2
		c0,1.5,0.3,2.9,1,4.2c0.7,1.2,1.6,2.1,2.8,2.8c1.2,0.7,2.5,1,3.9,1C308.7,28.2,310.1,27.8,311.3,27.2z"/>
	<path class="st0" d="M206.6,38.5h3.1c0.7-0.1,1.3,0.2,1.9,0.6c0.5,0.4,0.7,1.1,0.7,1.7c0,0.5-0.2,1.1-0.5,1.5
		c-0.4,0.4-0.9,0.7-1.4,0.8l1.9,3.4h-0.9l-1.9-3.3h-1.8v3.4h-0.9L206.6,38.5z M209.5,42.3c0.5,0,0.9-0.1,1.3-0.4
		c0.6-0.7,0.6-1.7,0-2.3c-0.4-0.3-0.8-0.4-1.3-0.3h-2v3.1H209.5z"/>
	<path class="st0" d="M214.2,45.9c-0.6-0.5-0.9-1.3-0.8-2.1c0-0.8,0.2-1.5,0.8-2.1c0.6-0.6,1.3-0.8,2.1-0.8c0.5,0,1.1,0.1,1.6,0.4
		c0.4,0.2,0.8,0.6,1,1c0.2,0.4,0.3,0.9,0.3,1.4v0.5h-5c0,0.5,0.2,1.1,0.7,1.4c0.5,0.3,1.1,0.5,1.7,0.5c0.3,0,0.7,0,1-0.1
		c0.3-0.1,0.6-0.1,0.9-0.3v0.7c-0.3,0.1-0.6,0.2-0.9,0.2c-0.4,0.1-0.8,0.1-1.1,0.1C215.7,46.7,214.9,46.4,214.2,45.9z M218.4,43.4
		c0-0.5-0.2-1-0.5-1.4c-0.4-0.4-1-0.6-1.5-0.5c-1-0.1-1.9,0.7-2,1.7c0,0.1,0,0.1,0,0.2L218.4,43.4z"/>
	<path class="st0" d="M221.9,46.5c-0.4-0.1-0.7-0.2-1-0.4v-0.7c0.3,0.2,0.6,0.3,1,0.4c0.4,0.1,0.7,0.2,1.1,0.2c0.3,0,0.7,0,1-0.2
		c0.2-0.1,0.3-0.4,0.3-0.6c0-0.2,0-0.3-0.1-0.5c-0.1-0.1-0.3-0.2-0.4-0.3c-0.3-0.1-0.7-0.2-1-0.3c-0.3-0.1-0.7-0.2-1-0.4
		c-0.2-0.1-0.4-0.3-0.6-0.5c-0.1-0.2-0.2-0.5-0.2-0.8c0-0.5,0.2-0.9,0.6-1.1c0.5-0.3,1-0.4,1.6-0.4c0.3,0,0.7,0,1,0.1
		c0.3,0.1,0.5,0.1,0.8,0.3v0.7c-0.2-0.1-0.5-0.2-0.8-0.3c-0.3-0.1-0.7-0.1-1-0.1c-0.3,0-0.7,0-1,0.2c-0.2,0.1-0.4,0.4-0.4,0.6
		c0,0.2,0,0.3,0.1,0.5c0.1,0.1,0.3,0.2,0.4,0.3c0.3,0.1,0.7,0.2,1,0.3c0.5,0.1,1,0.3,1.4,0.7c0.3,0.3,0.4,0.6,0.4,1
		c0,0.4-0.2,0.8-0.5,1.1c-0.5,0.3-1.1,0.4-1.6,0.4C222.5,46.6,222.2,46.5,221.9,46.5z"/>
	<path class="st0" d="M227.8,46.2c-0.3-0.4-0.5-0.8-0.4-1.3v-3.2h-0.8V41h0.9v-1.6h0.9V41h1.4v0.7h-1.4v3.2c0,0.3,0.1,0.6,0.2,0.8
		c0.2,0.2,0.5,0.3,0.8,0.2c0.2,0,0.4,0,0.6-0.1v0.7c-0.3,0.1-0.6,0.1-0.9,0.1C228.5,46.6,228.1,46.5,227.8,46.2z"/>
	<path class="st0" d="M231.8,46.1c-0.4-0.3-0.6-0.8-0.6-1.4c0-0.5,0.2-1,0.6-1.4c0.5-0.3,1-0.5,1.6-0.5c0.7,0,1.4,0.2,2,0.5V43
		c0-0.4-0.1-0.8-0.4-1.1c-0.4-0.3-0.9-0.4-1.3-0.4c-0.6,0-1.2,0.1-1.8,0.4v-0.7c0.3-0.1,0.6-0.2,0.9-0.2c0.3-0.1,0.7-0.1,1-0.1
		c0.7-0.1,1.4,0.2,1.9,0.6c0.5,0.4,0.7,1,0.6,1.7v3.4h-0.8v-0.7c-0.5,0.6-1.3,0.9-2.1,0.9C232.8,46.7,232.3,46.5,231.8,46.1z
		 M234.7,45.6c0.3-0.1,0.6-0.4,0.7-0.7v-0.8c-0.3-0.2-0.6-0.3-0.9-0.4c-0.3-0.1-0.7-0.1-1-0.1c-0.4,0-0.7,0.1-1.1,0.3
		c-0.2,0.2-0.4,0.6-0.3,0.9c0,0.8,0.5,1.1,1.5,1.1C234,45.9,234.4,45.8,234.7,45.6L234.7,45.6z"/>
	<path class="st0" d="M238.9,46c-0.4-0.4-0.6-1-0.6-1.6V41h0.9v3.5c0,1,0.5,1.4,1.5,1.4c0.4,0,0.8-0.1,1.1-0.3
		c0.3-0.2,0.6-0.5,0.8-0.9V41h0.9v5.5h-0.9v-0.8c-0.5,0.7-1.2,1-2.1,1C240,46.7,239.4,46.4,238.9,46z"/>
	<path class="st0" d="M245.7,41h0.8v1.1c0.6-0.8,1.5-1.2,2.5-1.1v0.7c-1.3,0-2.1,0.4-2.4,1.3v3.4h-0.9L245.7,41z"/>
	<path class="st0" d="M250.5,46.1c-0.4-0.3-0.6-0.8-0.6-1.4c0-0.5,0.2-1,0.6-1.3c0.5-0.4,1-0.5,1.6-0.5c0.7,0,1.4,0.2,2,0.5V43
		c0-0.4-0.1-0.8-0.4-1.1c-0.4-0.3-0.9-0.4-1.3-0.4c-0.6,0-1.2,0.1-1.8,0.4v-0.7c0.3-0.1,0.6-0.2,0.9-0.2c0.3-0.1,0.7-0.1,1-0.1
		c0.7-0.1,1.4,0.2,1.9,0.6c0.4,0.4,0.7,1,0.6,1.6v3.4h-0.8v-0.7c-0.5,0.6-1.3,0.9-2.1,0.9C251.5,46.6,250.9,46.4,250.5,46.1z
		 M253.4,45.6c0.3-0.1,0.6-0.4,0.7-0.7v-0.8c-0.3-0.2-0.6-0.3-0.9-0.4c-0.3-0.1-0.7-0.1-1-0.1c-0.4,0-0.8,0.1-1.1,0.3
		c-0.2,0.2-0.4,0.5-0.4,0.9c0,0.8,0.5,1.1,1.5,1.1C252.7,45.9,253.1,45.8,253.4,45.6L253.4,45.6z"/>
	<path class="st0" d="M257.1,41h0.9v0.8c0.3-0.3,0.6-0.6,1-0.8c0.4-0.2,0.8-0.2,1.2-0.2c0.6,0,1.2,0.2,1.6,0.6
		c0.4,0.4,0.6,1,0.5,1.5v3.5h-0.9V43c0-0.4-0.1-0.8-0.3-1.1c-0.3-0.3-0.7-0.4-1.1-0.4c-0.8,0-1.6,0.4-2,1.1v3.8h-0.9L257.1,41z"/>
	<path class="st0" d="M265.2,46.2c-0.3-0.4-0.5-0.8-0.4-1.3v-3.2H264V41h0.9v-1.6h0.9V41h1.4v0.7h-1.4v3.2c0,0.3,0.1,0.6,0.2,0.8
		c0.2,0.2,0.5,0.3,0.8,0.2c0.2,0,0.4,0,0.6-0.1v0.7c-0.3,0.1-0.6,0.1-0.9,0.1C266,46.6,265.6,46.5,265.2,46.2z"/>
	<path class="st0" d="M274,38.5h2.9c0.7,0,1.4,0.2,1.9,0.6c0.5,0.4,0.7,1.1,0.7,1.8c0.1,0.7-0.2,1.3-0.7,1.7c-0.6,0.4-1.3,0.6-2,0.6
		h-2.1v3.3H274L274,38.5z M276.9,42.4c0.5,0,0.9-0.1,1.3-0.3c0.4-0.3,0.5-0.8,0.5-1.2c0-0.5-0.1-0.9-0.5-1.3
		c-0.4-0.2-0.9-0.4-1.3-0.3h-2v3.2H276.9z"/>
	<path class="st0" d="M281.3,38.1h0.9v8.4h-0.9V38.1z"/>
	<path class="st0" d="M284.7,46.1c-0.4-0.3-0.6-0.8-0.6-1.4c0-0.5,0.2-1,0.5-1.4c0.5-0.4,1-0.5,1.6-0.5c0.7,0,1.4,0.2,2,0.5V43
		c0-0.4-0.1-0.8-0.4-1.1c-0.4-0.3-0.9-0.4-1.3-0.4c-0.6,0-1.2,0.1-1.8,0.4v-0.7c0.3-0.1,0.6-0.2,0.9-0.2c0.3-0.1,0.7-0.1,1-0.1
		c0.7-0.1,1.4,0.2,1.9,0.6c0.4,0.4,0.7,1,0.6,1.6v3.4h-0.8v-0.7c-0.5,0.6-1.3,0.9-2.1,0.9C285.6,46.6,285.1,46.4,284.7,46.1z
		 M287.6,45.6c0.3-0.1,0.6-0.4,0.8-0.7v-0.8c-0.3-0.2-0.6-0.3-0.9-0.4c-0.3-0.1-0.7-0.1-1-0.1c-0.4,0-0.8,0.1-1.1,0.3
		c-0.2,0.2-0.4,0.5-0.4,0.9c0,0.8,0.5,1.1,1.5,1.1C286.8,45.9,287.2,45.8,287.6,45.6L287.6,45.6z"/>
	<path class="st0" d="M291.8,46.2c-0.3-0.4-0.5-0.8-0.4-1.3v-3.2h-0.9V41h0.9v-1.6h0.9V41h1.4v0.7h-1.4v3.2c0,0.3,0,0.6,0.2,0.8
		c0.2,0.2,0.5,0.3,0.8,0.2c0.2,0,0.4,0,0.6-0.1v0.7c-0.3,0.1-0.6,0.1-0.9,0.1C292.6,46.6,292.1,46.5,291.8,46.2z"/>
	<path class="st0" d="M295.8,41.7H295V41h0.9v-1.2c0-0.5,0.1-1,0.5-1.3c0.4-0.3,0.8-0.5,1.3-0.5c0.3,0,0.5,0,0.8,0.1v0.7
		c-0.2-0.1-0.4-0.2-0.7-0.2c-0.3,0-0.6,0.1-0.8,0.3c-0.2,0.2-0.3,0.6-0.3,0.9V41h1.4v0.7h-1.4v4.8h-0.9V41.7z"/>
	<path class="st0" d="M300.7,46.3c-0.4-0.2-0.8-0.6-1.1-1c-0.3-0.5-0.4-1-0.4-1.5c0-0.5,0.1-1.1,0.4-1.5c0.3-0.4,0.6-0.8,1.1-1
		c0.5-0.3,1-0.4,1.6-0.4c0.5,0,1.1,0.1,1.6,0.4c0.4,0.2,0.8,0.6,1.1,1c0.3,0.5,0.4,1,0.4,1.5c0,0.5-0.1,1.1-0.4,1.5
		c-0.3,0.4-0.6,0.8-1.1,1C302.8,46.7,301.7,46.7,300.7,46.3L300.7,46.3z M303.8,45.3c0.4-0.4,0.6-1,0.6-1.6c0-0.6-0.2-1.2-0.6-1.6
		c-0.9-0.8-2.2-0.8-3.1,0c-0.4,0.4-0.6,1-0.6,1.6c0,0.6,0.2,1.2,0.6,1.6C301.6,46.1,302.9,46.1,303.8,45.3z"/>
	<path class="st0" d="M307.2,41h0.9v1.1c0.6-0.8,1.5-1.2,2.4-1.1v0.7c-1.3,0-2.1,0.4-2.4,1.3v3.4h-0.9L307.2,41z"/>
	<path class="st0" d="M312.2,41h0.8v0.9c0.4-0.6,1.2-1,1.9-1c0.4,0,0.7,0.1,1.1,0.2c0.3,0.2,0.5,0.4,0.5,0.7
		c0.2-0.3,0.5-0.6,0.9-0.7c0.3-0.2,0.7-0.2,1.1-0.2c0.5,0,1,0.1,1.4,0.5c0.3,0.4,0.5,0.9,0.4,1.5v3.6h-0.9v-3.6
		c0-0.4-0.1-0.8-0.3-1.1c-0.3-0.2-0.6-0.3-0.9-0.3c-0.6,0-1.3,0.3-1.6,0.9c0,0.2,0,0.3,0,0.5v3.5h-0.9v-3.5c0-0.4-0.1-0.7-0.3-1.1
		c-0.2-0.2-0.6-0.4-0.9-0.3c-0.7,0-1.4,0.5-1.7,1.1v3.8h-0.9L312.2,41z"/>
</g>
</svg>
