{
  "type": "FeatureCollection",
  "features": [
    {
      "type": "Feature",
      "properties": {
        "Nombre": "Hospital de San Pedro",
        "Localidad": "San Pedro",
        "Calle": "Almirante Brown",
        "Numero": "",
        "CodigoPostal": 3352,
        "Telefono": "+54 3751 470010",
        "email": "",
        "OSM": 870955589,
        "Fuente": "http://www.salud.misiones.gov.ar/index.php/red-sanitaria/hospitales"
      },
      "geometry": {
        "type": "Point",
        "coordinates": [
          -54.1078255,
          -26.6186912
        ]
      }
    },
    {
      "type": "Feature",
      "properties": {
        "Nombre": "Hospital Montecarlo Doctor Oscar Eugenio Darú",
        "Localidad": "Montecarlo",
        "Calle": "Comandante Andresito",
        "Numero": 117,
        "CodigoPostal": "",
        "Telefono": "+54 3751 480020",
        "email": "",
        "OSM": 1393564169,
        "Fuente": "http://www.salud.misiones.gov.ar/index.php/red-sanitaria/hospitales"
      },
      "geometry": {
        "type": "Point",
        "coordinates": [
          -54.7665377,
          -26.5684384
        ]
      }
    },
    {
      "type": "Feature",
      "properties": {
        "Nombre": "Hospital Ramón Carrillo",
        "Localidad": "Posadas",
        "Calle": "Avenida Quaranta",
        "Numero": "",
        "CodigoPostal": "",
        "Telefono": "+5 376 4458263",
        "email": "",
        "OSM": 1698682689,
        "Fuente": ""
      },
      "geometry": {
        "type": "Point",
        "coordinates": [
          -55.9523281,
          -27.3985158
        ]
      }
    },
    {
      "type": "Feature",
      "properties": {
        "Nombre": "Hospital Doctor Pedro Baliña",
        "Localidad": "Posadas",
        "Calle": "Avenida Quaranta",
        "Numero": "",
        "CodigoPostal": "",
        "Telefono": "+54 376 4458248",
        "email": "",
        "OSM": 1698683341,
        "Fuente": ""
      },
      "geometry": {
        "type": "Point",
        "coordinates": [
          -55.9512123,
          -27.3985292
        ]
      }
    },
    {
      "type": "Feature",
      "properties": {
        "Nombre": "Hospital René Favaloro",
        "Localidad": "Capioví",
        "Calle": "Avenida San Luis Gonzaga",
        "Numero": 375,
        "CodigoPostal": "",
        "Telefono": "+54 3743 493299",
        "email": "",
        "OSM": 2604527696,
        "Fuente": "http://www.salud.misiones.gov.ar/index.php/red-sanitaria/hospitales"
      },
      "geometry": {
        "type": "Point",
        "coordinates": [
          -55.0578671,
          -26.9277421
        ]
      }
    },
    {
      "type": "Feature",
      "properties": {
        "Nombre": "Hospital de Área",
        "Localidad": "Concepción de la Sierra",
        "Calle": "Avenida Gonzalo de Doblas",
        "Numero": "",
        "CodigoPostal": 3355,
        "Telefono": "",
        "email": "",
        "OSM": 2613102628,
        "Fuente": "Neco Barrios y Asociados para el Gran Atlas de Misiones"
      },
      "geometry": {
        "type": "Point",
        "coordinates": [
          -55.5137438,
          -27.9818261
        ]
      }
    },
    {
      "type": "Feature",
      "properties": {
        "Nombre": "Hospital SAMIC de San Vicente",
        "Localidad": "San Vicente",
        "Calle": "Ruta Nacional 14",
        "Numero": "",
        "CodigoPostal": 3356,
        "Telefono": "+54 3755 461840",
        "email": "",
        "OSM": 3648050736,
        "Fuente": ""
      },
      "geometry": {
        "type": "Point",
        "coordinates": [
          -54.4770993,
          -26.9882666
        ]
      }
    },
    {
      "type": "Feature",
      "properties": {
        "Nombre": "Hospital de Colonia Delicia",
        "Localidad": "Colonia Delicia",
        "Calle": "Avenida José Invernizzi",
        "Numero": 12,
        "CodigoPostal": "",
        "Telefono": "+54 3751 427777",
        "email": "",
        "OSM": 3648887420,
        "Fuente": "http://www.salud.misiones.gov.ar/index.php/red-sanitaria/hospitales"
      },
      "geometry": {
        "type": "Point",
        "coordinates": [
          -54.6043156,
          -26.2321945
        ]
      }
    },
    {
      "type": "Feature",
      "properties": {
        "Nombre": "Hospital de San José",
        "Localidad": "San José",
        "Calle": "Islas Malvinas Argentinas",
        "Numero": 829,
        "CodigoPostal": 3307,
        "Telefono": "+54 3758 492213",
        "email": "",
        "OSM": 3659043803,
        "Fuente": "http://www.salud.misiones.gov.ar/index.php/red-sanitaria/hospitales"
      },
      "geometry": {
        "type": "Point",
        "coordinates": [
          -55.7807166,
          -27.7681279
        ]
      }
    },
    {
      "type": "Feature",
      "properties": {
        "Nombre": "Hospital Nivel I",
        "Localidad": "Campo Grande",
        "Calle": "Pasteur",
        "Numero": "",
        "CodigoPostal": 3362,
        "Telefono": "+54 3755 499190",
        "email": "hospitalcampogrande@hotmail.com",
        "OSM": 4112790623,
        "Fuente": "http://www.salud.misiones.gov.ar/index.php/red-sanitaria/hospitales"
      },
      "geometry": {
        "type": "Point",
        "coordinates": [
          -54.9781751,
          -27.2040827
        ]
      }
    },
    {
      "type": "Feature",
      "properties": {
        "Nombre": "Hospital Almirante Brown",
        "Localidad": "Comandante Andresito",
        "Calle": "Avenida El Libertador",
        "Numero": "",
        "CodigoPostal": 3385,
        "Telefono": "+54 3757 497061",
        "email": "",
        "OSM": 4423611899,
        "Fuente": ""
      },
      "geometry": {
        "type": "Point",
        "coordinates": [
          -54.0489418,
          -25.667128
        ]
      }
    },
    {
      "type": "Feature",
      "properties": {
        "Nombre": "Hospital Vírgen de Fátima",
        "Localidad": "Garupá",
        "Calle": "Avenida Jorge Kemerer",
        "Numero": 1576,
        "CodigoPostal": 3304,
        "Telefono": "+54 376 4409118",
        "email": "",
        "OSM": 4423695520,
        "Fuente": "http://www.salud.misiones.gov.ar/index.php/red-sanitaria/hospitales"
      },
      "geometry": {
        "type": "Point",
        "coordinates": [
          -55.8695798,
          -27.4364015
        ]
      }
    },
    {
      "type": "Feature",
      "properties": {
        "Nombre": "Hospital SAMIC Eldorado",
        "Localidad": "Eldorado",
        "Calle": "Doctor Prieto",
        "Numero": "",
        "CodigoPostal": 3380,
        "Telefono": "+54 3751 421536",
        "email": "",
        "OSM": 4424281147,
        "Fuente": "http://www.salud.misiones.gov.ar/red-sanitaria/hospitales"
      },
      "geometry": {
        "type": "Point",
        "coordinates": [
          -54.5972769,
          -26.4048225
        ]
      }
    },
    {
      "type": "Feature",
      "properties": {
        "Nombre": "Hospital SAMIC de Oberá",
        "Localidad": "Oberá",
        "Calle": "Avenida Pincén",
        "Numero": "",
        "CodigoPostal": "",
        "Telefono": "+54 3755 421227",
        "email": "",
        "OSM": 4424289354,
        "Fuente": "http://www.salud.misiones.gov.ar/red-sanitaria/hospitales"
      },
      "geometry": {
        "type": "Point",
        "coordinates": [
          -55.1445208,
          -27.4923502
        ]
      }
    },
    {
      "type": "Feature",
      "properties": {
        "Nombre": "Hospital Doctor Tadayoshi Kamada",
        "Localidad": "Jardin América",
        "Calle": "Aconcagua",
        "Numero": 575,
        "CodigoPostal": "",
        "Telefono": "+54 3743 460174",
        "email": "hospijam@gmail.com",
        "OSM": 4424295826,
        "Fuente": "http://www.salud.misiones.gov.ar/red-sanitaria/hospitales"
      },
      "geometry": {
        "type": "Point",
        "coordinates": [
          -55.2296101,
          -27.0384763
        ]
      }
    },
    {
      "type": "Feature",
      "properties": {
        "Nombre": "Hospital “Doctor Bernardo Allassia”",
        "Localidad": "Apóstoles",
        "Calle": "Tucumán",
        "Numero": 569,
        "CodigoPostal": 3350,
        "Telefono": "+54 3758 422666",
        "email": "",
        "OSM": 4424308453,
        "Fuente": "http://www.salud.misiones.gov.ar/red-sanitaria/hospitales"
      },
      "geometry": {
        "type": "Point",
        "coordinates": [
          -55.7503429,
          -27.9075657
        ]
      }
    },
    {
      "type": "Feature",
      "properties": {
        "Nombre": "Hospital de Candelaria",
        "Localidad": "Candelaria",
        "Calle": "Avenida San Roque González",
        "Numero": 836,
        "CodigoPostal": "",
        "Telefono": "+54 376 4493212",
        "email": "hospitaldecandelaria@hotmail.com.ar",
        "OSM": 4424477989,
        "Fuente": ""
      },
      "geometry": {
        "type": "Point",
        "coordinates": [
          -55.7452336,
          -27.4623676
        ]
      }
    },
    {
      "type": "Feature",
      "properties": {
        "Nombre": "Hospital de Santa Ana",
        "Localidad": "Santa Ana",
        "Calle": "Avenida Manuel Belgrano",
        "Numero": "",
        "CodigoPostal": 3316,
        "Telefono": "+54 376 4497127",
        "email": "capssanamsp@hotmail.com.ar",
        "OSM": 4424480589,
        "Fuente": ""
      },
      "geometry": {
        "type": "Point",
        "coordinates": [
          -55.5805891,
          -27.3689134
        ]
      }
    },
    {
      "type": "Feature",
      "properties": {
        "Nombre": "Hospital de San Ignacio",
        "Localidad": "San Ignacio",
        "Calle": "Avenida Horacio Quiroga",
        "Numero": 635,
        "CodigoPostal": 3322,
        "Telefono": "+54 376 4470007",
        "email": "hospitalsanignacio@gmail.com",
        "OSM": 4424482963,
        "Fuente": "http://www.salud.misiones.gov.ar/index.php/red-sanitaria/hospitales"
      },
      "geometry": {
        "type": "Point",
        "coordinates": [
          -55.5408046,
          -27.2556211
        ]
      }
    },
    {
      "type": "Feature",
      "properties": {
        "Nombre": "Hospital de Gobernador Roca",
        "Localidad": "Gobernador Roca",
        "Calle": "Rivadavia",
        "Numero": "",
        "CodigoPostal": 3324,
        "Telefono": "+54 376 4498017",
        "email": "",
        "OSM": 4424484084,
        "Fuente": "http://www.salud.misiones.gov.ar/index.php/red-sanitaria/hospitales"
      },
      "geometry": {
        "type": "Point",
        "coordinates": [
          -55.465774,
          -27.1839878
        ]
      }
    },
    {
      "type": "Feature",
      "properties": {
        "Nombre": "Hospital de Corpus",
        "Localidad": "Corpus",
        "Calle": "Avenida Curupaity",
        "Numero": "",
        "CodigoPostal": 3327,
        "Telefono": "+54 376 4495044",
        "email": "hospitaldecorpus@hotmail.com",
        "OSM": 4424489402,
        "Fuente": "http://www.salud.misiones.gov.ar/index.php/red-sanitaria/hospitales"
      },
      "geometry": {
        "type": "Point",
        "coordinates": [
          -55.5121088,
          -27.1309739
        ]
      }
    },
    {
      "type": "Feature",
      "properties": {
        "Nombre": "Hospital de área Doctor Ricardo Gutierrez",
        "Localidad": "Puerto Rico",
        "Calle": "Doctor Ricardo Gutiérrez",
        "Numero": 55,
        "CodigoPostal": 3334,
        "Telefono": "+54 3743 420520",
        "email": "",
        "OSM": 4424492396,
        "Fuente": ""
      },
      "geometry": {
        "type": "Point",
        "coordinates": [
          -55.0274185,
          -26.8152608
        ]
      }
    },
    {
      "type": "Feature",
      "properties": {
        "Nombre": "Hospital de Puerto Piray",
        "Localidad": "Puerto Piray",
        "Calle": "Avenida Marcos Paz",
        "Numero": "",
        "CodigoPostal": 3381,
        "Telefono": "+54 3751 461325",
        "email": "",
        "OSM": 4424495431,
        "Fuente": "http://www.salud.misiones.gov.ar/index.php/red-sanitaria/hospitales"
      },
      "geometry": {
        "type": "Point",
        "coordinates": [
          -54.7050275,
          -26.4670588
        ]
      }
    },
    {
      "type": "Feature",
      "properties": {
        "Nombre": "Hospital de Puerto Esperanza",
        "Localidad": "Puerto Esperanza",
        "Calle": "Nicaragua",
        "Numero": "",
        "CodigoPostal": 3378,
        "Telefono": "+54 3757 480197",
        "email": "hospitalesperanza@gmail.com",
        "OSM": 4424502672,
        "Fuente": "http://www.salud.misiones.gov.ar/index.php/red-sanitaria/hospitales"
      },
      "geometry": {
        "type": "Point",
        "coordinates": [
          -54.6059915,
          -26.0218443
        ]
      }
    },
    {
      "type": "Feature",
      "properties": {
        "Nombre": "Hospital de Puerto Libertad",
        "Localidad": "Puerto Libertad",
        "Calle": "Avenida Juan Domingo Perón",
        "Numero": 1331,
        "CodigoPostal": "",
        "Telefono": "+54 3757 496055",
        "email": "",
        "OSM": 4424508939,
        "Fuente": ""
      },
      "geometry": {
        "type": "Point",
        "coordinates": [
          -54.5885182,
          -25.9212068
        ]
      }
    },
    {
      "type": "Feature",
      "properties": {
        "Nombre": "Hospital S.A.M.I.C. Doctora. Marta Schwartz",
        "Localidad": "Puerto Iguazú",
        "Calle": "Avenida Victoria Aguirre",
        "Numero": 142,
        "CodigoPostal": "",
        "Telefono": "+54 3757 420626",
        "email": "",
        "OSM": 4424509850,
        "Fuente": "http://www.salud.misiones.gov.ar/index.php/red-sanitaria/hospitales"
      },
      "geometry": {
        "type": "Point",
        "coordinates": [
          -54.5736932,
          -25.601183
        ]
      }
    },
    {
      "type": "Feature",
      "properties": {
        "Nombre": "Hospital de San Antonio",
        "Localidad": "San Antonio",
        "Calle": "Avenida Andresito",
        "Numero": 750,
        "CodigoPostal": "",
        "Telefono": "+54 3741 493054",
        "email": "",
        "OSM": 4424981817,
        "Fuente": ""
      },
      "geometry": {
        "type": "Point",
        "coordinates": [
          -53.7357857,
          -26.0563252
        ]
      }
    },
    {
      "type": "Feature",
      "properties": {
        "Nombre": "Hospital de Bernardo de Irigoyen",
        "Localidad": "Bernardo de Irigoyen",
        "Calle": "Avenida de Las Américas",
        "Numero": "",
        "CodigoPostal": 3366,
        "Telefono": "+54 3741 420201",
        "email": "",
        "OSM": 4424986133,
        "Fuente": ""
      },
      "geometry": {
        "type": "Point",
        "coordinates": [
          -53.65148,
          -26.2493166
        ]
      }
    },
    {
      "type": "Feature",
      "properties": {
        "Nombre": "Hospital de 25 de Mayo",
        "Localidad": "Veinticinco de Mayo",
        "Calle": "Comandante Andresito",
        "Numero": 22,
        "CodigoPostal": 3363,
        "Telefono": "+54 3755 493066",
        "email": "",
        "OSM": 4425015718,
        "Fuente": "http://www.salud.misiones.gov.ar/index.php/red-sanitaria/hospitales"
      },
      "geometry": {
        "type": "Point",
        "coordinates": [
          -54.7442249,
          -27.3791759
        ]
      }
    },
    {
      "type": "Feature",
      "properties": {
        "Nombre": "Hospital de Dos de Mayo",
        "Localidad": "Dos de Mayo",
        "Calle": "Perú",
        "Numero": "",
        "CodigoPostal": 3364,
        "Telefono": "+54 3755 496715",
        "email": "labhospitaldosdemayo@hotmail.com",
        "OSM": 4425942392,
        "Fuente": ""
      },
      "geometry": {
        "type": "Point",
        "coordinates": [
          -54.687661,
          -27.0168158
        ]
      }
    },
    {
      "type": "Feature",
      "properties": {
        "Nombre": "Hospital de Aristóbulo del Valle Dr. Justo José Pereyra",
        "Localidad": "Aristóbulo del Valle",
        "Calle": "Corrientes",
        "Numero": 2001,
        "CodigoPostal": 3364,
        "Telefono": "+54 3755 471001",
        "email": "hospitaladelvalle@hotmail.com.ar",
        "OSM": 4425972117,
        "Fuente": "http://www.salud.misiones.gov.ar/index.php/red-sanitaria/hospitales"
      },
      "geometry": {
        "type": "Point",
        "coordinates": [
          -54.888261,
          -27.10427
        ]
      }
    },
    {
      "type": "Feature",
      "properties": {
        "Nombre": "Hospital Doctor Ricardo Alba Posse",
        "Localidad": "Alba Posse",
        "Calle": "Ruta Provincial 8",
        "Numero": "",
        "CodigoPostal": 3364,
        "Telefono": "+54 3755 482011",
        "email": "",
        "OSM": 4425974806,
        "Fuente": ""
      },
      "geometry": {
        "type": "Point",
        "coordinates": [
          -54.6831892,
          -27.5653172
        ]
      }
    },
    {
      "type": "Feature",
      "properties": {
        "Nombre": "Hospital SAMIC Doctor Juan Fernando Alegre",
        "Localidad": "Leandro N. Alem",
        "Calle": "Rivadavia",
        "Numero": 710,
        "CodigoPostal": 3315,
        "Telefono": "+54 3754 420290",
        "email": "",
        "OSM": 4425975831,
        "Fuente": ""
      },
      "geometry": {
        "type": "Point",
        "coordinates": [
          -55.3299219,
          -27.6082916
        ]
      }
    },
    {
      "type": "Feature",
      "properties": {
        "Nombre": "Hospital de Cerro Azul",
        "Localidad": "Cerro Azul",
        "Calle": "Tomás Guido",
        "Numero": 900,
        "CodigoPostal": "",
        "Telefono": "+54 376 4494208",
        "email": "",
        "OSM": 4425976260,
        "Fuente": "http://www.salud.misiones.gov.ar/index.php/red-sanitaria/hospitales"
      },
      "geometry": {
        "type": "Point",
        "coordinates": [
          -55.4986587,
          -27.6356816
        ]
      }
    },
    {
      "type": "Feature",
      "properties": {
        "Nombre": "Hospital de Bonpland",
        "Localidad": "Bonpland",
        "Calle": "Juan Lavalle",
        "Numero": "",
        "CodigoPostal": 3317,
        "Telefono": "+54 376 4492053",
        "email": "capsbonpland@gmail.com",
        "OSM": 4425977869,
        "Fuente": "http://www.salud.misiones.gov.ar/index.php/red-sanitaria/hospitales"
      },
      "geometry": {
        "type": "Point",
        "coordinates": [
          -55.4726302,
          -27.4844519
        ]
      }
    },
    {
      "type": "Feature",
      "properties": {
        "Nombre": "Hospital Doctor René Favaloro",
        "Localidad": "Posadas",
        "Calle": "Avenida Tambor de Tacuarí",
        "Numero": 7300,
        "CodigoPostal": "",
        "Telefono": "+54 376 4468015",
        "email": "",
        "OSM": 4426017497,
        "Fuente": "http://www.salud.misiones.gov.ar/index.php/red-sanitaria/hospitales"
      },
      "geometry": {
        "type": "Point",
        "coordinates": [
          -55.949421,
          -27.3651406
        ]
      }
    },
    {
      "type": "Feature",
      "properties": {
        "Nombre": "Hospital Colonia Aurora",
        "Localidad": "",
        "Calle": "Avenida San Martín",
        "Numero": "",
        "CodigoPostal": "",
        "Telefono": "",
        "email": "",
        "OSM": 4952478659,
        "Fuente": ""
      },
      "geometry": {
        "type": "Point",
        "coordinates": [
          -54.530216,
          -27.4773346
        ]
      }
    },
    {
      "type": "Feature",
      "properties": {
        "Nombre": "Hospital de Área Montecarlo",
        "Localidad": "Montecarlo",
        "Calle": "Neuquén",
        "Numero": "",
        "CodigoPostal": 3384,
        "Telefono": 480020,
        "email": "",
        "OSM": 5331224113,
        "Fuente": ""
      },
      "geometry": {
        "type": "Point",
        "coordinates": [
          -54.734397,
          -26.5732254
        ]
      }
    },
    {
      "type": "Feature",
      "properties": {
        "Nombre": "Hospital Nivel I",
        "Localidad": "Colonia Wanda",
        "Calle": "Avenida San Martín",
        "Numero": "",
        "CodigoPostal": 3376,
        "Telefono": "",
        "email": "",
        "OSM": 6125725230,
        "Fuente": "http://www.cadenadelsol.com.ar/?a=211948&PHPSESSID=2ce77ab122584ee0f37d32b2c339c9cf"
      },
      "geometry": {
        "type": "Point",
        "coordinates": [
          -54.5562924,
          -25.9716579
        ]
      }
    },
    {
      "type": "Feature",
      "properties": {
        "Nombre": "Hospital de San Javier",
        "Localidad": "San Javier",
        "Calle": "Estanislao Lassaga",
        "Numero": 121,
        "CodigoPostal": 3357,
        "Telefono": "+54 3754 483031",
        "email": "",
        "OSM": 6237978660,
        "Fuente": ""
      },
      "geometry": {
        "type": "Point",
        "coordinates": [
          -55.1376347,
          -27.8690037
        ]
      }
    },
    {
      "type": "Feature",
      "properties": {
        "Nombre": "Hospital Monoclínico de Geriatría Miguel Lanus",
        "Localidad": "MIguel Lanús",
        "Calle": "Avenida Juan Domingo Perón",
        "Numero": 2020,
        "CodigoPostal": 3304,
        "Telefono": "",
        "email": "",
        "OSM": 7341453369,
        "Fuente": ""
      },
      "geometry": {
        "type": "Point",
        "coordinates": [
          -55.8851719,
          -27.4328143
        ]
      }
    },
    {
      "type": "Feature",
      "properties": {
        "Nombre": "Hospital SAMIC Eldorado",
        "Localidad": "Eldorado",
        "Calle": "Avenida San Martín Oeste",
        "Numero": "",
        "CodigoPostal": "",
        "Telefono": "",
        "email": "",
        "OSM": 7341453370,
        "Fuente": ""
      },
      "geometry": {
        "type": "Point",
        "coordinates": [
          -54.6640252,
          -26.4075916
        ]
      }
    },
    {
      "type": "Feature",
      "properties": {
        "Nombre": "Hospital de Concepción de la Sierra",
        "Localidad": "Concepción de la Sierra",
        "Calle": "Bartolomé Mitre",
        "Numero": "",
        "CodigoPostal": 3355,
        "Telefono": "+54 3758 470010",
        "email": "",
        "OSM": 7341455378,
        "Fuente": ""
      },
      "geometry": {
        "type": "Point",
        "coordinates": [
          -55.5210814,
          -27.9824684
        ]
      }
    },
    {
      "type": "Feature",
      "properties": {
        "Nombre": "Hospital de El Soberbio",
        "Localidad": "El Soberbio",
        "Calle": "Chivilcoy",
        "Numero": "",
        "CodigoPostal": 3368,
        "Telefono": "+54 3755 495087",
        "email": "",
        "OSM": 7341462783,
        "Fuente": "http://www.salud.misiones.gov.ar/index.php/red-sanitaria/hospitales"
      },
      "geometry": {
        "type": "Point",
        "coordinates": [
          -54.2001193,
          -27.302679
        ]
      }
    },
    {
      "type": "Feature",
      "properties": {
        "Nombre": "Hospital de Azara",
        "Localidad": "Azara",
        "Calle": "Ucrania",
        "Numero": "",
        "CodigoPostal": 3351,
        "Telefono": "+54 3758 493130",
        "email": "",
        "OSM": 7341502567,
        "Fuente": "http://www.salud.misiones.gov.ar/index.php/red-sanitaria/hospitales"
      },
      "geometry": {
        "type": "Point",
        "coordinates": [
          -55.6759733,
          -28.0611286
        ]
      }
    },
    {
      "type": "Feature",
      "properties": {
        "Nombre": "Hospital de Nivel I Itaembé Guazú",
        "Localidad": "Posadas",
        "Calle": "Las Orquídeas",
        "Numero": 6450,
        "CodigoPostal": 3300,
        "Telefono": "",
        "email": "",
        "OSM": 7341528392,
        "Fuente": ""
      },
      "geometry": {
        "type": "Point",
        "coordinates": [
          -55.9838589,
          -27.410024
        ]
      }
    },
    {
      "type": "Feature",
      "properties": {
        "Nombre": "Hospital Escuela de Agudos Doctor Ramón Madariaga",
        "Localidad": "Posadas",
        "Calle": "Avenida Cabred",
        "Numero": 1120,
        "CodigoPostal": 3300,
        "Telefono": "+54 376 4443700",
        "email": "",
        "OSM": 7473661611,
        "Fuente": ""
      },
      "geometry": {
        "type": "Point",
        "coordinates": [
          -55.8895339,
          -27.3844682
        ]
      }
    },
    {
      "type": "Feature",
      "properties": {
        "Nombre": "Hospital Materno Neonatal",
        "Localidad": "Posadas",
        "Calle": "Avenida Marconi",
        "Numero": 3464,
        "CodigoPostal": 3300,
        "Telefono": "+54 376 4447842",
        "email": "",
        "OSM": 7473661612,
        "Fuente": ""
      },
      "geometry": {
        "type": "Point",
        "coordinates": [
          -55.8890514,
          -27.3834756
        ]
      }
    },
    {
      "type": "Feature",
      "properties": {
        "Nombre": "Centro de Oncología y Terapia Radiante",
        "Localidad": "Posadas",
        "Calle": "Avenida Marconi",
        "Numero": 3400,
        "CodigoPostal": 3300,
        "Telefono": "",
        "email": "",
        "OSM": 7473661613,
        "Fuente": ""
      },
      "geometry": {
        "type": "Point",
        "coordinates": [
          -55.8886844,
          -27.3825458
        ]
      }
    },
    {
      "type": "Feature",
      "properties": {
        "Nombre": "Hospital Materno Neonatal",
        "Localidad": "Posadas",
        "Calle": "Avenida López Torres",
        "Numero": 3700,
        "CodigoPostal": 3300,
        "Telefono": "",
        "email": "",
        "OSM": 7473661614,
        "Fuente": ""
      },
      "geometry": {
        "type": "Point",
        "coordinates": [
          -55.891742,
          -27.3838305
        ]
      }
    },
    {
      "type": "Feature",
      "properties": {
        "Nombre": "Hospital de Pediatría Doctor Fernando Barreyro",
        "Localidad": "Posadas",
        "Calle": "Avenida Mariano Moreno",
        "Numero": 110,
        "CodigoPostal": 3300,
        "Telefono": "+54 376 4447100",
        "email": "hospitaldepediatriafbarreyro@gmail.com",
        "OSM": 7473661615,
        "Fuente": ""
      },
      "geometry": {
        "type": "Point",
        "coordinates": [
          -55.890341,
          -27.3826578
        ]
      }
    },
    {
      "type": "Feature",
      "properties": {
        "Nombre": "Hospital de Santo Pipó",
        "Localidad": "Santo Pipó",
        "Calle": "Avenida San Martín",
        "Numero": "",
        "CodigoPostal": 3326,
        "Telefono": "",
        "email": "",
        "OSM": 7608364840,
        "Fuente": ""
      },
      "geometry": {
        "type": "Point",
        "coordinates": [
          -55.4073759,
          -27.1404097
        ]
      }
    }
  ]
}
