{
  "type": "FeatureCollection",
  "features": [
    {
      "type": "Feature",
      "properties": {
        "bright_ti4": "367",
        "scan": "0.36",
        "track": "0.57",
        "acq_date": "2021-12-07",
        "acq_time": "0529",
        "satellite": "N",
        "confidence": "high",
        "version": "2.0NRT",
        "bright_ti5": "291.62",
        "frp": "5.85",
        "daynight": "N"
      },
      "geometry": {
        "type": "Point",
        "coordinates": [
          -55.74119,
          -27.58858
        ]
      }
    },
    {
      "type": "Feature",
      "properties": {
        "bright_ti4": "367",
        "scan": "0.32",
        "track": "0.55",
        "acq_date": "2021-12-07",
        "acq_time": "0527",
        "satellite": "N",
        "confidence": "high",
        "version": "2.0NRT",
        "bright_ti5": "294.34",
        "frp": "5.59",
        "daynight": "N"
      },
      "geometry": {
        "type": "Point",
        "coordinates": [
          -54.65978,
          -18.08703
        ]
      }
    },
    {
      "type": "Feature",
      "properties": {
        "bright_ti4": "367",
        "scan": "0.32",
        "track": "0.55",
        "acq_date": "2021-12-07",
        "acq_time": "0527",
        "satellite": "N",
        "confidence": "high",
        "version": "2.0NRT",
        "bright_ti5": "295.21",
        "frp": "6.28",
        "daynight": "N"
      },
      "geometry": {
        "type": "Point",
        "coordinates": [
          -54.65968,
          -18.08461
        ]
      }
    },
    {
      "type": "Feature",
      "properties": {
        "bright_ti4": "367",
        "scan": "0.54",
        "track": "0.68",
        "acq_date": "2021-12-07",
        "acq_time": "0703",
        "satellite": "N",
        "confidence": "high",
        "version": "2.0NRT",
        "bright_ti5": "288.6",
        "frp": "7.72",
        "daynight": "N"
      },
      "geometry": {
        "type": "Point",
        "coordinates": [
          -72.22435,
          3.53873
        ]
      }
    },
    {
      "type": "Feature",
      "properties": {
        "bright_ti4": "367",
        "scan": "0.55",
        "track": "0.68",
        "acq_date": "2021-12-07",
        "acq_time": "0703",
        "satellite": "N",
        "confidence": "high",
        "version": "2.0NRT",
        "bright_ti5": "289.34",
        "frp": "10.52",
        "daynight": "N"
      },
      "geometry": {
        "type": "Point",
        "coordinates": [
          -72.22345,
          3.53617
        ]
      }
    },
    {
      "type": "Feature",
      "properties": {
        "bright_ti4": "367",
        "scan": "0.58",
        "track": "0.52",
        "acq_date": "2021-12-07",
        "acq_time": "1620",
        "satellite": "N",
        "confidence": "high",
        "version": "2.0NRT",
        "bright_ti5": "299.05",
        "frp": "19.58",
        "daynight": "D"
      },
      "geometry": {
        "type": "Point",
        "coordinates": [
          -34.88807,
          -7.22788
        ]
      }
    },
    {
      "type": "Feature",
      "properties": {
        "bright_ti4": "367",
        "scan": "0.39",
        "track": "0.44",
        "acq_date": "2021-12-07",
        "acq_time": "1620",
        "satellite": "N",
        "confidence": "high",
        "version": "2.0NRT",
        "bright_ti5": "308.57",
        "frp": "7.83",
        "daynight": "D"
      },
      "geometry": {
        "type": "Point",
        "coordinates": [
          -37.56043,
          -7.52797
        ]
      }
    },
    {
      "type": "Feature",
      "properties": {
        "bright_ti4": "367",
        "scan": "0.55",
        "track": "0.43",
        "acq_date": "2021-12-07",
        "acq_time": "1620",
        "satellite": "N",
        "confidence": "high",
        "version": "2.0NRT",
        "bright_ti5": "312.54",
        "frp": "13.81",
        "daynight": "D"
      },
      "geometry": {
        "type": "Point",
        "coordinates": [
          -38.13432,
          -6.71222
        ]
      }
    },
    {
      "type": "Feature",
      "properties": {
        "bright_ti4": "367",
        "scan": "0.52",
        "track": "0.41",
        "acq_date": "2021-12-07",
        "acq_time": "1620",
        "satellite": "N",
        "confidence": "high",
        "version": "2.0NRT",
        "bright_ti5": "308.54",
        "frp": "10.65",
        "daynight": "D"
      },
      "geometry": {
        "type": "Point",
        "coordinates": [
          -38.79231,
          -5.72665
        ]
      }
    },
    {
      "type": "Feature",
      "properties": {
        "bright_ti4": "367",
        "scan": "0.5",
        "track": "0.41",
        "acq_date": "2021-12-07",
        "acq_time": "1620",
        "satellite": "N",
        "confidence": "high",
        "version": "2.0NRT",
        "bright_ti5": "328.79",
        "frp": "103.23",
        "daynight": "D"
      },
      "geometry": {
        "type": "Point",
        "coordinates": [
          -39.19025,
          -5.47824
        ]
      }
    },
    {
      "type": "Feature",
      "properties": {
        "bright_ti4": "367",
        "scan": "0.41",
        "track": "0.37",
        "acq_date": "2021-12-07",
        "acq_time": "1620",
        "satellite": "N",
        "confidence": "high",
        "version": "2.0NRT",
        "bright_ti5": "350.55",
        "frp": "63.55",
        "daynight": "D"
      },
      "geometry": {
        "type": "Point",
        "coordinates": [
          -41.09378,
          -5.52059
        ]
      }
    },
    {
      "type": "Feature",
      "properties": {
        "bright_ti4": "367",
        "scan": "0.41",
        "track": "0.37",
        "acq_date": "2021-12-07",
        "acq_time": "1620",
        "satellite": "N",
        "confidence": "high",
        "version": "2.0NRT",
        "bright_ti5": "311.77",
        "frp": "16.69",
        "daynight": "D"
      },
      "geometry": {
        "type": "Point",
        "coordinates": [
          -41.08682,
          -5.51601
        ]
      }
    },
    {
      "type": "Feature",
      "properties": {
        "bright_ti4": "367",
        "scan": "0.41",
        "track": "0.37",
        "acq_date": "2021-12-07",
        "acq_time": "1620",
        "satellite": "N",
        "confidence": "high",
        "version": "2.0NRT",
        "bright_ti5": "350.57",
        "frp": "119.48",
        "daynight": "D"
      },
      "geometry": {
        "type": "Point",
        "coordinates": [
          -41.09428,
          -5.51715
        ]
      }
    },
    {
      "type": "Feature",
      "properties": {
        "bright_ti4": "367",
        "scan": "0.38",
        "track": "0.36",
        "acq_date": "2021-12-07",
        "acq_time": "1622",
        "satellite": "N",
        "confidence": "high",
        "version": "2.0NRT",
        "bright_ti5": "294.11",
        "frp": "6.93",
        "daynight": "D"
      },
      "geometry": {
        "type": "Point",
        "coordinates": [
          -43.25559,
          -3.43696
        ]
      }
    },
    {
      "type": "Feature",
      "properties": {
        "bright_ti4": "367",
        "scan": "0.34",
        "track": "0.56",
        "acq_date": "2021-12-07",
        "acq_time": "1615",
        "satellite": "N",
        "confidence": "high",
        "version": "2.0NRT",
        "bright_ti5": "297.54",
        "frp": "6.83",
        "daynight": "D"
      },
      "geometry": {
        "type": "Point",
        "coordinates": [
          -48.64982,
          -21.06103
        ]
      }
    },
    {
      "type": "Feature",
      "properties": {
        "bright_ti4": "367",
        "scan": "0.64",
        "track": "0.72",
        "acq_date": "2021-12-07",
        "acq_time": "1617",
        "satellite": "N",
        "confidence": "high",
        "version": "2.0NRT",
        "bright_ti5": "299.29",
        "frp": "13.19",
        "daynight": "D"
      },
      "geometry": {
        "type": "Point",
        "coordinates": [
          -53.13016,
          -19.46348
        ]
      }
    },
    {
      "type": "Feature",
      "properties": {
        "bright_ti4": "367",
        "scan": "0.64",
        "track": "0.72",
        "acq_date": "2021-12-07",
        "acq_time": "1617",
        "satellite": "N",
        "confidence": "high",
        "version": "2.0NRT",
        "bright_ti5": "297.77",
        "frp": "13.19",
        "daynight": "D"
      },
      "geometry": {
        "type": "Point",
        "coordinates": [
          -53.13678,
          -19.46401
        ]
      }
    },
    {
      "type": "Feature",
      "properties": {
        "bright_ti4": "367",
        "scan": "0.64",
        "track": "0.72",
        "acq_date": "2021-12-07",
        "acq_time": "1617",
        "satellite": "N",
        "confidence": "high",
        "version": "2.0NRT",
        "bright_ti5": "297.97",
        "frp": "12.96",
        "daynight": "D"
      },
      "geometry": {
        "type": "Point",
        "coordinates": [
          -53.1324,
          -19.46141
        ]
      }
    },
    {
      "type": "Feature",
      "properties": {
        "bright_ti4": "367",
        "scan": "0.65",
        "track": "0.73",
        "acq_date": "2021-12-07",
        "acq_time": "1617",
        "satellite": "N",
        "confidence": "high",
        "version": "2.0NRT",
        "bright_ti5": "301.06",
        "frp": "24.81",
        "daynight": "D"
      },
      "geometry": {
        "type": "Point",
        "coordinates": [
          -53.45924,
          -18.24931
        ]
      }
    },
    {
      "type": "Feature",
      "properties": {
        "bright_ti4": "367",
        "scan": "0.6",
        "track": "0.71",
        "acq_date": "2021-12-07",
        "acq_time": "1617",
        "satellite": "N",
        "confidence": "high",
        "version": "2.0NRT",
        "bright_ti5": "300.78",
        "frp": "12.35",
        "daynight": "D"
      },
      "geometry": {
        "type": "Point",
        "coordinates": [
          -52.97979,
          -18.00722
        ]
      }
    },
    {
      "type": "Feature",
      "properties": {
        "bright_ti4": "367",
        "scan": "0.32",
        "track": "0.55",
        "acq_date": "2021-12-07",
        "acq_time": "1806",
        "satellite": "N",
        "confidence": "high",
        "version": "2.0NRT",
        "bright_ti5": "295.09",
        "frp": "7.24",
        "daynight": "D"
      },
      "geometry": {
        "type": "Point",
        "coordinates": [
          -63.4606,
          9.72558
        ]
      }
    },
    {
      "type": "Feature",
      "properties": {
        "bright_ti4": "367",
        "scan": "0.32",
        "track": "0.55",
        "acq_date": "2021-12-07",
        "acq_time": "1806",
        "satellite": "N",
        "confidence": "high",
        "version": "2.0NRT",
        "bright_ti5": "296.2",
        "frp": "7.24",
        "daynight": "D"
      },
      "geometry": {
        "type": "Point",
        "coordinates": [
          -63.46132,
          9.73063
        ]
      }
    },
    {
      "type": "Feature",
      "properties": {
        "bright_ti4": "367",
        "scan": "0.32",
        "track": "0.55",
        "acq_date": "2021-12-07",
        "acq_time": "1806",
        "satellite": "N",
        "confidence": "high",
        "version": "2.0NRT",
        "bright_ti5": "298.57",
        "frp": "13.01",
        "daynight": "D"
      },
      "geometry": {
        "type": "Point",
        "coordinates": [
          -63.47377,
          9.73417
        ]
      }
    },
    {
      "type": "Feature",
      "properties": {
        "bright_ti4": "367",
        "scan": "0.33",
        "track": "0.55",
        "acq_date": "2021-12-07",
        "acq_time": "1806",
        "satellite": "N",
        "confidence": "high",
        "version": "2.0NRT",
        "bright_ti5": "293.59",
        "frp": "8.9",
        "daynight": "D"
      },
      "geometry": {
        "type": "Point",
        "coordinates": [
          -63.2685,
          9.77613
        ]
      }
    },
    {
      "type": "Feature",
      "properties": {
        "bright_ti4": "367",
        "scan": "0.34",
        "track": "0.56",
        "acq_date": "2021-12-07",
        "acq_time": "1806",
        "satellite": "N",
        "confidence": "high",
        "version": "2.0NRT",
        "bright_ti5": "295.23",
        "frp": "9.85",
        "daynight": "D"
      },
      "geometry": {
        "type": "Point",
        "coordinates": [
          -63.18023,
          9.97453
        ]
      }
    },
    {
      "type": "Feature",
      "properties": {
        "bright_ti4": "367",
        "scan": "0.43",
        "track": "0.38",
        "acq_date": "2021-12-07",
        "acq_time": "1753",
        "satellite": "N",
        "confidence": "high",
        "version": "2.0NRT",
        "bright_ti5": "311.76",
        "frp": "16.82",
        "daynight": "D"
      },
      "geometry": {
        "type": "Point",
        "coordinates": [
          -59.18879,
          -31.13876
        ]
      }
    },
    {
      "type": "Feature",
      "properties": {
        "bright_ti4": "367",
        "scan": "0.32",
        "track": "0.55",
        "acq_date": "2021-12-07",
        "acq_time": "1753",
        "satellite": "N",
        "confidence": "high",
        "version": "2.0NRT",
        "bright_ti5": "298.99",
        "frp": "5.17",
        "daynight": "D"
      },
      "geometry": {
        "type": "Point",
        "coordinates": [
          -52.6436,
          -29.77032
        ]
      }
    },
    {
      "type": "Feature",
      "properties": {
        "bright_ti4": "367",
        "scan": "0.44",
        "track": "0.38",
        "acq_date": "2021-12-07",
        "acq_time": "1756",
        "satellite": "N",
        "confidence": "high",
        "version": "2.0NRT",
        "bright_ti5": "315.89",
        "frp": "28.45",
        "daynight": "D"
      },
      "geometry": {
        "type": "Point",
        "coordinates": [
          -59.15354,
          -30.74411
        ]
      }
    },
    {
      "type": "Feature",
      "properties": {
        "bright_ti4": "367",
        "scan": "0.42",
        "track": "0.38",
        "acq_date": "2021-12-07",
        "acq_time": "1756",
        "satellite": "N",
        "confidence": "high",
        "version": "2.0NRT",
        "bright_ti5": "319.32",
        "frp": "11.36",
        "daynight": "D"
      },
      "geometry": {
        "type": "Point",
        "coordinates": [
          -59.76031,
          -30.66512
        ]
      }
    },
    {
      "type": "Feature",
      "properties": {
        "bright_ti4": "367",
        "scan": "0.33",
        "track": "0.55",
        "acq_date": "2021-12-07",
        "acq_time": "1756",
        "satellite": "N",
        "confidence": "high",
        "version": "2.0NRT",
        "bright_ti5": "301.48",
        "frp": "6.45",
        "daynight": "D"
      },
      "geometry": {
        "type": "Point",
        "coordinates": [
          -52.66735,
          -29.23311
        ]
      }
    },
    {
      "type": "Feature",
      "properties": {
        "bright_ti4": "367",
        "scan": "0.4",
        "track": "0.37",
        "acq_date": "2021-12-07",
        "acq_time": "1756",
        "satellite": "N",
        "confidence": "high",
        "version": "2.0NRT",
        "bright_ti5": "338.83",
        "frp": "100.58",
        "daynight": "D"
      },
      "geometry": {
        "type": "Point",
        "coordinates": [
          -61.04543,
          -29.7143
        ]
      }
    },
    {
      "type": "Feature",
      "properties": {
        "bright_ti4": "367",
        "scan": "0.4",
        "track": "0.37",
        "acq_date": "2021-12-07",
        "acq_time": "1756",
        "satellite": "N",
        "confidence": "high",
        "version": "2.0NRT",
        "bright_ti5": "341.96",
        "frp": "298.41",
        "daynight": "D"
      },
      "geometry": {
        "type": "Point",
        "coordinates": [
          -61.05025,
          -29.7116
        ]
      }
    },
    {
      "type": "Feature",
      "properties": {
        "bright_ti4": "367",
        "scan": "0.38",
        "track": "0.36",
        "acq_date": "2021-12-07",
        "acq_time": "1756",
        "satellite": "N",
        "confidence": "high",
        "version": "2.0NRT",
        "bright_ti5": "346.58",
        "frp": "56.04",
        "daynight": "D"
      },
      "geometry": {
        "type": "Point",
        "coordinates": [
          -62.66961,
          -29.09657
        ]
      }
    },
    {
      "type": "Feature",
      "properties": {
        "bright_ti4": "367",
        "scan": "0.38",
        "track": "0.36",
        "acq_date": "2021-12-07",
        "acq_time": "1756",
        "satellite": "N",
        "confidence": "high",
        "version": "2.0NRT",
        "bright_ti5": "307.52",
        "frp": "56.04",
        "daynight": "D"
      },
      "geometry": {
        "type": "Point",
        "coordinates": [
          -62.66629,
          -29.09263
        ]
      }
    },
    {
      "type": "Feature",
      "properties": {
        "bright_ti4": "367",
        "scan": "0.33",
        "track": "0.56",
        "acq_date": "2021-12-07",
        "acq_time": "1756",
        "satellite": "N",
        "confidence": "high",
        "version": "2.0NRT",
        "bright_ti5": "298.54",
        "frp": "22.05",
        "daynight": "D"
      },
      "geometry": {
        "type": "Point",
        "coordinates": [
          -53.72071,
          -26.30739
        ]
      }
    },
    {
      "type": "Feature",
      "properties": {
        "bright_ti4": "367",
        "scan": "0.33",
        "track": "0.55",
        "acq_date": "2021-12-07",
        "acq_time": "1756",
        "satellite": "N",
        "confidence": "high",
        "version": "2.0NRT",
        "bright_ti5": "300.87",
        "frp": "5.88",
        "daynight": "D"
      },
      "geometry": {
        "type": "Point",
        "coordinates": [
          -53.84204,
          -26.31307
        ]
      }
    },
    {
      "type": "Feature",
      "properties": {
        "bright_ti4": "367",
        "scan": "0.39",
        "track": "0.6",
        "acq_date": "2021-12-07",
        "acq_time": "1756",
        "satellite": "N",
        "confidence": "high",
        "version": "2.0NRT",
        "bright_ti5": "297.24",
        "frp": "7.07",
        "daynight": "D"
      },
      "geometry": {
        "type": "Point",
        "coordinates": [
          -52.79129,
          -25.56096
        ]
      }
    },
    {
      "type": "Feature",
      "properties": {
        "bright_ti4": "367",
        "scan": "0.45",
        "track": "0.63",
        "acq_date": "2021-12-07",
        "acq_time": "1756",
        "satellite": "N",
        "confidence": "high",
        "version": "2.0NRT",
        "bright_ti5": "293.24",
        "frp": "13.98",
        "daynight": "D"
      },
      "geometry": {
        "type": "Point",
        "coordinates": [
          -51.91553,
          -25.2702
        ]
      }
    },
    {
      "type": "Feature",
      "properties": {
        "bright_ti4": "367",
        "scan": "0.39",
        "track": "0.59",
        "acq_date": "2021-12-07",
        "acq_time": "1756",
        "satellite": "N",
        "confidence": "high",
        "version": "2.0NRT",
        "bright_ti5": "298.54",
        "frp": "15.92",
        "daynight": "D"
      },
      "geometry": {
        "type": "Point",
        "coordinates": [
          -52.92073,
          -25.49859
        ]
      }
    },
    {
      "type": "Feature",
      "properties": {
        "bright_ti4": "367",
        "scan": "0.39",
        "track": "0.59",
        "acq_date": "2021-12-07",
        "acq_time": "1756",
        "satellite": "N",
        "confidence": "high",
        "version": "2.0NRT",
        "bright_ti5": "294.46",
        "frp": "11.13",
        "daynight": "D"
      },
      "geometry": {
        "type": "Point",
        "coordinates": [
          -52.91849,
          -25.49884
        ]
      }
    },
    {
      "type": "Feature",
      "properties": {
        "bright_ti4": "367",
        "scan": "0.38",
        "track": "0.43",
        "acq_date": "2021-12-07",
        "acq_time": "1756",
        "satellite": "N",
        "confidence": "high",
        "version": "2.0NRT",
        "bright_ti5": "311.59",
        "frp": "12.73",
        "daynight": "D"
      },
      "geometry": {
        "type": "Point",
        "coordinates": [
          -58.19047,
          -25.31608
        ]
      }
    },
    {
      "type": "Feature",
      "properties": {
        "bright_ti4": "367",
        "scan": "0.4",
        "track": "0.44",
        "acq_date": "2021-12-07",
        "acq_time": "1756",
        "satellite": "N",
        "confidence": "high",
        "version": "2.0NRT",
        "bright_ti5": "308.45",
        "frp": "14.56",
        "daynight": "D"
      },
      "geometry": {
        "type": "Point",
        "coordinates": [
          -57.89914,
          -25.00952
        ]
      }
    },
    {
      "type": "Feature",
      "properties": {
        "bright_ti4": "367",
        "scan": "0.4",
        "track": "0.44",
        "acq_date": "2021-12-07",
        "acq_time": "1756",
        "satellite": "N",
        "confidence": "high",
        "version": "2.0NRT",
        "bright_ti5": "310.1",
        "frp": "20.97",
        "daynight": "D"
      },
      "geometry": {
        "type": "Point",
        "coordinates": [
          -57.90808,
          -25.00697
        ]
      }
    },
    {
      "type": "Feature",
      "properties": {
        "bright_ti4": "367",
        "scan": "0.41",
        "track": "0.45",
        "acq_date": "2021-12-07",
        "acq_time": "1756",
        "satellite": "N",
        "confidence": "high",
        "version": "2.0NRT",
        "bright_ti5": "306.91",
        "frp": "7.67",
        "daynight": "D"
      },
      "geometry": {
        "type": "Point",
        "coordinates": [
          -57.86462,
          -24.88101
        ]
      }
    },
    {
      "type": "Feature",
      "properties": {
        "bright_ti4": "367",
        "scan": "0.43",
        "track": "0.46",
        "acq_date": "2021-12-07",
        "acq_time": "1756",
        "satellite": "N",
        "confidence": "high",
        "version": "2.0NRT",
        "bright_ti5": "314.88",
        "frp": "10.71",
        "daynight": "D"
      },
      "geometry": {
        "type": "Point",
        "coordinates": [
          -57.58981,
          -24.6318
        ]
      }
    },
    {
      "type": "Feature",
      "properties": {
        "bright_ti4": "367",
        "scan": "0.39",
        "track": "0.44",
        "acq_date": "2021-12-07",
        "acq_time": "1756",
        "satellite": "N",
        "confidence": "high",
        "version": "2.0NRT",
        "bright_ti5": "313.4",
        "frp": "13.89",
        "daynight": "D"
      },
      "geometry": {
        "type": "Point",
        "coordinates": [
          -58.22826,
          -24.61168
        ]
      }
    },
    {
      "type": "Feature",
      "properties": {
        "bright_ti4": "367",
        "scan": "0.39",
        "track": "0.44",
        "acq_date": "2021-12-07",
        "acq_time": "1756",
        "satellite": "N",
        "confidence": "high",
        "version": "2.0NRT",
        "bright_ti5": "308.8",
        "frp": "13.38",
        "daynight": "D"
      },
      "geometry": {
        "type": "Point",
        "coordinates": [
          -58.23397,
          -24.60435
        ]
      }
    },
    {
      "type": "Feature",
      "properties": {
        "bright_ti4": "367",
        "scan": "0.39",
        "track": "0.44",
        "acq_date": "2021-12-07",
        "acq_time": "1756",
        "satellite": "N",
        "confidence": "high",
        "version": "2.0NRT",
        "bright_ti5": "313.35",
        "frp": "7.87",
        "daynight": "D"
      },
      "geometry": {
        "type": "Point",
        "coordinates": [
          -58.29741,
          -24.59132
        ]
      }
    },
    {
      "type": "Feature",
      "properties": {
        "bright_ti4": "367",
        "scan": "0.4",
        "track": "0.44",
        "acq_date": "2021-12-07",
        "acq_time": "1756",
        "satellite": "N",
        "confidence": "high",
        "version": "2.0NRT",
        "bright_ti5": "321.58",
        "frp": "20.26",
        "daynight": "D"
      },
      "geometry": {
        "type": "Point",
        "coordinates": [
          -58.03586,
          -24.53634
        ]
      }
    },
    {
      "type": "Feature",
      "properties": {
        "bright_ti4": "367",
        "scan": "0.4",
        "track": "0.44",
        "acq_date": "2021-12-07",
        "acq_time": "1756",
        "satellite": "N",
        "confidence": "high",
        "version": "2.0NRT",
        "bright_ti5": "333.56",
        "frp": "74.68",
        "daynight": "D"
      },
      "geometry": {
        "type": "Point",
        "coordinates": [
          -58.03985,
          -24.53712
        ]
      }
    },
    {
      "type": "Feature",
      "properties": {
        "bright_ti4": "367",
        "scan": "0.39",
        "track": "0.44",
        "acq_date": "2021-12-07",
        "acq_time": "1756",
        "satellite": "N",
        "confidence": "high",
        "version": "2.0NRT",
        "bright_ti5": "318.58",
        "frp": "26.72",
        "daynight": "D"
      },
      "geometry": {
        "type": "Point",
        "coordinates": [
          -58.29447,
          -24.58655
        ]
      }
    },
    {
      "type": "Feature",
      "properties": {
        "bright_ti4": "367",
        "scan": "0.4",
        "track": "0.44",
        "acq_date": "2021-12-07",
        "acq_time": "1756",
        "satellite": "N",
        "confidence": "high",
        "version": "2.0NRT",
        "bright_ti5": "326.55",
        "frp": "74.68",
        "daynight": "D"
      },
      "geometry": {
        "type": "Point",
        "coordinates": [
          -58.04475,
          -24.53381
        ]
      }
    },
    {
      "type": "Feature",
      "properties": {
        "bright_ti4": "367",
        "scan": "0.41",
        "track": "0.45",
        "acq_date": "2021-12-07",
        "acq_time": "1756",
        "satellite": "N",
        "confidence": "high",
        "version": "2.0NRT",
        "bright_ti5": "313.74",
        "frp": "7.03",
        "daynight": "D"
      },
      "geometry": {
        "type": "Point",
        "coordinates": [
          -57.84249,
          -24.47154
        ]
      }
    },
    {
      "type": "Feature",
      "properties": {
        "bright_ti4": "367",
        "scan": "0.41",
        "track": "0.45",
        "acq_date": "2021-12-07",
        "acq_time": "1756",
        "satellite": "N",
        "confidence": "high",
        "version": "2.0NRT",
        "bright_ti5": "320.11",
        "frp": "10.04",
        "daynight": "D"
      },
      "geometry": {
        "type": "Point",
        "coordinates": [
          -57.84628,
          -24.45499
        ]
      }
    },
    {
      "type": "Feature",
      "properties": {
        "bright_ti4": "367",
        "scan": "0.45",
        "track": "0.63",
        "acq_date": "2021-12-07",
        "acq_time": "1756",
        "satellite": "N",
        "confidence": "high",
        "version": "2.0NRT",
        "bright_ti5": "298.14",
        "frp": "7.54",
        "daynight": "D"
      },
      "geometry": {
        "type": "Point",
        "coordinates": [
          -52.67077,
          -23.29497
        ]
      }
    },
    {
      "type": "Feature",
      "properties": {
        "bright_ti4": "367",
        "scan": "0.42",
        "track": "0.45",
        "acq_date": "2021-12-07",
        "acq_time": "1756",
        "satellite": "N",
        "confidence": "high",
        "version": "2.0NRT",
        "bright_ti5": "312.5",
        "frp": "6.88",
        "daynight": "D"
      },
      "geometry": {
        "type": "Point",
        "coordinates": [
          -57.696,
          -24.37356
        ]
      }
    },
    {
      "type": "Feature",
      "properties": {
        "bright_ti4": "367",
        "scan": "0.49",
        "track": "0.4",
        "acq_date": "2021-12-07",
        "acq_time": "1756",
        "satellite": "N",
        "confidence": "high",
        "version": "2.0NRT",
        "bright_ti5": "319.42",
        "frp": "11.14",
        "daynight": "D"
      },
      "geometry": {
        "type": "Point",
        "coordinates": [
          -59.79646,
          -24.77051
        ]
      }
    },
    {
      "type": "Feature",
      "properties": {
        "bright_ti4": "367",
        "scan": "0.42",
        "track": "0.45",
        "acq_date": "2021-12-07",
        "acq_time": "1756",
        "satellite": "N",
        "confidence": "high",
        "version": "2.0NRT",
        "bright_ti5": "314.82",
        "frp": "27.51",
        "daynight": "D"
      },
      "geometry": {
        "type": "Point",
        "coordinates": [
          -57.70114,
          -24.37021
        ]
      }
    },
    {
      "type": "Feature",
      "properties": {
        "bright_ti4": "367",
        "scan": "0.56",
        "track": "0.43",
        "acq_date": "2021-12-07",
        "acq_time": "1756",
        "satellite": "N",
        "confidence": "high",
        "version": "2.0NRT",
        "bright_ti5": "320.59",
        "frp": "14.71",
        "daynight": "D"
      },
      "geometry": {
        "type": "Point",
        "coordinates": [
          -58.6501,
          -24.53179
        ]
      }
    },
    {
      "type": "Feature",
      "properties": {
        "bright_ti4": "367",
        "scan": "0.43",
        "track": "0.46",
        "acq_date": "2021-12-07",
        "acq_time": "1756",
        "satellite": "N",
        "confidence": "high",
        "version": "2.0NRT",
        "bright_ti5": "318.57",
        "frp": "9.81",
        "daynight": "D"
      },
      "geometry": {
        "type": "Point",
        "coordinates": [
          -57.67669,
          -24.30493
        ]
      }
    },
    {
      "type": "Feature",
      "properties": {
        "bright_ti4": "367",
        "scan": "0.42",
        "track": "0.45",
        "acq_date": "2021-12-07",
        "acq_time": "1756",
        "satellite": "N",
        "confidence": "high",
        "version": "2.0NRT",
        "bright_ti5": "319.28",
        "frp": "33.55",
        "daynight": "D"
      },
      "geometry": {
        "type": "Point",
        "coordinates": [
          -57.83131,
          -24.29585
        ]
      }
    },
    {
      "type": "Feature",
      "properties": {
        "bright_ti4": "367",
        "scan": "0.42",
        "track": "0.45",
        "acq_date": "2021-12-07",
        "acq_time": "1756",
        "satellite": "N",
        "confidence": "high",
        "version": "2.0NRT",
        "bright_ti5": "319.53",
        "frp": "33.55",
        "daynight": "D"
      },
      "geometry": {
        "type": "Point",
        "coordinates": [
          -57.83543,
          -24.29665
        ]
      }
    },
    {
      "type": "Feature",
      "properties": {
        "bright_ti4": "367",
        "scan": "0.41",
        "track": "0.45",
        "acq_date": "2021-12-07",
        "acq_time": "1756",
        "satellite": "N",
        "confidence": "high",
        "version": "2.0NRT",
        "bright_ti5": "322.9",
        "frp": "19.16",
        "daynight": "D"
      },
      "geometry": {
        "type": "Point",
        "coordinates": [
          -58.04599,
          -24.26723
        ]
      }
    },
    {
      "type": "Feature",
      "properties": {
        "bright_ti4": "367",
        "scan": "0.41",
        "track": "0.45",
        "acq_date": "2021-12-07",
        "acq_time": "1756",
        "satellite": "N",
        "confidence": "high",
        "version": "2.0NRT",
        "bright_ti5": "355.06",
        "frp": "62.48",
        "daynight": "D"
      },
      "geometry": {
        "type": "Point",
        "coordinates": [
          -58.05002,
          -24.268
        ]
      }
    },
    {
      "type": "Feature",
      "properties": {
        "bright_ti4": "367",
        "scan": "0.41",
        "track": "0.45",
        "acq_date": "2021-12-07",
        "acq_time": "1756",
        "satellite": "N",
        "confidence": "high",
        "version": "2.0NRT",
        "bright_ti5": "324.75",
        "frp": "9.39",
        "daynight": "D"
      },
      "geometry": {
        "type": "Point",
        "coordinates": [
          -58.0429,
          -24.26235
        ]
      }
    },
    {
      "type": "Feature",
      "properties": {
        "bright_ti4": "367",
        "scan": "0.42",
        "track": "0.45",
        "acq_date": "2021-12-07",
        "acq_time": "1756",
        "satellite": "N",
        "confidence": "high",
        "version": "2.0NRT",
        "bright_ti5": "315.43",
        "frp": "14.45",
        "daynight": "D"
      },
      "geometry": {
        "type": "Point",
        "coordinates": [
          -57.89513,
          -24.147
        ]
      }
    },
    {
      "type": "Feature",
      "properties": {
        "bright_ti4": "367",
        "scan": "0.51",
        "track": "0.41",
        "acq_date": "2021-12-07",
        "acq_time": "1756",
        "satellite": "N",
        "confidence": "high",
        "version": "2.0NRT",
        "bright_ti5": "354.39",
        "frp": "102.14",
        "daynight": "D"
      },
      "geometry": {
        "type": "Point",
        "coordinates": [
          -59.54591,
          -24.4147
        ]
      }
    },
    {
      "type": "Feature",
      "properties": {
        "bright_ti4": "367",
        "scan": "0.5",
        "track": "0.49",
        "acq_date": "2021-12-07",
        "acq_time": "1756",
        "satellite": "N",
        "confidence": "high",
        "version": "2.0NRT",
        "bright_ti5": "315.59",
        "frp": "24.81",
        "daynight": "D"
      },
      "geometry": {
        "type": "Point",
        "coordinates": [
          -56.66016,
          -23.84836
        ]
      }
    },
    {
      "type": "Feature",
      "properties": {
        "bright_ti4": "367",
        "scan": "0.43",
        "track": "0.46",
        "acq_date": "2021-12-07",
        "acq_time": "1756",
        "satellite": "N",
        "confidence": "high",
        "version": "2.0NRT",
        "bright_ti5": "313.77",
        "frp": "7.15",
        "daynight": "D"
      },
      "geometry": {
        "type": "Point",
        "coordinates": [
          -57.79459,
          -23.95752
        ]
      }
    },
    {
      "type": "Feature",
      "properties": {
        "bright_ti4": "367",
        "scan": "0.4",
        "track": "0.44",
        "acq_date": "2021-12-07",
        "acq_time": "1756",
        "satellite": "N",
        "confidence": "high",
        "version": "2.0NRT",
        "bright_ti5": "311.15",
        "frp": "7.91",
        "daynight": "D"
      },
      "geometry": {
        "type": "Point",
        "coordinates": [
          -58.29085,
          -23.78724
        ]
      }
    },
    {
      "type": "Feature",
      "properties": {
        "bright_ti4": "367",
        "scan": "0.42",
        "track": "0.46",
        "acq_date": "2021-12-07",
        "acq_time": "1756",
        "satellite": "N",
        "confidence": "high",
        "version": "2.0NRT",
        "bright_ti5": "317.51",
        "frp": "15.61",
        "daynight": "D"
      },
      "geometry": {
        "type": "Point",
        "coordinates": [
          -57.9069,
          -23.66605
        ]
      }
    },
    {
      "type": "Feature",
      "properties": {
        "bright_ti4": "367",
        "scan": "0.43",
        "track": "0.46",
        "acq_date": "2021-12-07",
        "acq_time": "1756",
        "satellite": "N",
        "confidence": "high",
        "version": "2.0NRT",
        "bright_ti5": "322.43",
        "frp": "17.24",
        "daynight": "D"
      },
      "geometry": {
        "type": "Point",
        "coordinates": [
          -57.80182,
          -23.6059
        ]
      }
    },
    {
      "type": "Feature",
      "properties": {
        "bright_ti4": "367",
        "scan": "0.55",
        "track": "0.43",
        "acq_date": "2021-12-07",
        "acq_time": "1756",
        "satellite": "N",
        "confidence": "high",
        "version": "2.0NRT",
        "bright_ti5": "315.44",
        "frp": "20.15",
        "daynight": "D"
      },
      "geometry": {
        "type": "Point",
        "coordinates": [
          -59.01889,
          -23.82952
        ]
      }
    },
    {
      "type": "Feature",
      "properties": {
        "bright_ti4": "367",
        "scan": "0.43",
        "track": "0.46",
        "acq_date": "2021-12-07",
        "acq_time": "1756",
        "satellite": "N",
        "confidence": "high",
        "version": "2.0NRT",
        "bright_ti5": "320.72",
        "frp": "11.22",
        "daynight": "D"
      },
      "geometry": {
        "type": "Point",
        "coordinates": [
          -57.80108,
          -23.60672
        ]
      }
    },
    {
      "type": "Feature",
      "properties": {
        "bright_ti4": "367",
        "scan": "0.55",
        "track": "0.43",
        "acq_date": "2021-12-07",
        "acq_time": "1756",
        "satellite": "N",
        "confidence": "high",
        "version": "2.0NRT",
        "bright_ti5": "314.87",
        "frp": "11.67",
        "daynight": "D"
      },
      "geometry": {
        "type": "Point",
        "coordinates": [
          -59.02114,
          -23.83093
        ]
      }
    },
    {
      "type": "Feature",
      "properties": {
        "bright_ti4": "367",
        "scan": "0.4",
        "track": "0.44",
        "acq_date": "2021-12-07",
        "acq_time": "1756",
        "satellite": "N",
        "confidence": "high",
        "version": "2.0NRT",
        "bright_ti5": "315.02",
        "frp": "6.79",
        "daynight": "D"
      },
      "geometry": {
        "type": "Point",
        "coordinates": [
          -58.42223,
          -23.43484
        ]
      }
    },
    {
      "type": "Feature",
      "properties": {
        "bright_ti4": "367",
        "scan": "0.42",
        "track": "0.45",
        "acq_date": "2021-12-07",
        "acq_time": "1758",
        "satellite": "N",
        "confidence": "high",
        "version": "2.0NRT",
        "bright_ti5": "320.49",
        "frp": "13.53",
        "daynight": "D"
      },
      "geometry": {
        "type": "Point",
        "coordinates": [
          -58.22654,
          -22.97548
        ]
      }
    },
    {
      "type": "Feature",
      "properties": {
        "bright_ti4": "367",
        "scan": "0.47",
        "track": "0.47",
        "acq_date": "2021-12-07",
        "acq_time": "1758",
        "satellite": "N",
        "confidence": "high",
        "version": "2.0NRT",
        "bright_ti5": "314.4",
        "frp": "13.43",
        "daynight": "D"
      },
      "geometry": {
        "type": "Point",
        "coordinates": [
          -57.61501,
          -22.33583
        ]
      }
    },
    {
      "type": "Feature",
      "properties": {
        "bright_ti4": "367",
        "scan": "0.45",
        "track": "0.47",
        "acq_date": "2021-12-07",
        "acq_time": "1758",
        "satellite": "N",
        "confidence": "high",
        "version": "2.0NRT",
        "bright_ti5": "334.56",
        "frp": "62.61",
        "daynight": "D"
      },
      "geometry": {
        "type": "Point",
        "coordinates": [
          -58.04137,
          -21.96205
        ]
      }
    },
    {
      "type": "Feature",
      "properties": {
        "bright_ti4": "367",
        "scan": "0.45",
        "track": "0.47",
        "acq_date": "2021-12-07",
        "acq_time": "1758",
        "satellite": "N",
        "confidence": "high",
        "version": "2.0NRT",
        "bright_ti5": "311.33",
        "frp": "76.86",
        "daynight": "D"
      },
      "geometry": {
        "type": "Point",
        "coordinates": [
          -58.04049,
          -21.87975
        ]
      }
    },
    {
      "type": "Feature",
      "properties": {
        "bright_ti4": "367",
        "scan": "0.46",
        "track": "0.39",
        "acq_date": "2021-12-07",
        "acq_time": "1758",
        "satellite": "N",
        "confidence": "high",
        "version": "2.0NRT",
        "bright_ti5": "313.79",
        "frp": "15.69",
        "daynight": "D"
      },
      "geometry": {
        "type": "Point",
        "coordinates": [
          -61.08056,
          -22.09309
        ]
      }
    },
    {
      "type": "Feature",
      "properties": {
        "bright_ti4": "367",
        "scan": "0.46",
        "track": "0.39",
        "acq_date": "2021-12-07",
        "acq_time": "1758",
        "satellite": "N",
        "confidence": "high",
        "version": "2.0NRT",
        "bright_ti5": "313.45",
        "frp": "15.69",
        "daynight": "D"
      },
      "geometry": {
        "type": "Point",
        "coordinates": [
          -61.08128,
          -22.08948
        ]
      }
    },
    {
      "type": "Feature",
      "properties": {
        "bright_ti4": "367",
        "scan": "0.46",
        "track": "0.39",
        "acq_date": "2021-12-07",
        "acq_time": "1758",
        "satellite": "N",
        "confidence": "high",
        "version": "2.0NRT",
        "bright_ti5": "314.82",
        "frp": "15.69",
        "daynight": "D"
      },
      "geometry": {
        "type": "Point",
        "coordinates": [
          -61.08575,
          -22.09025
        ]
      }
    },
    {
      "type": "Feature",
      "properties": {
        "bright_ti4": "367",
        "scan": "0.46",
        "track": "0.39",
        "acq_date": "2021-12-07",
        "acq_time": "1758",
        "satellite": "N",
        "confidence": "high",
        "version": "2.0NRT",
        "bright_ti5": "314.15",
        "frp": "9.38",
        "daynight": "D"
      },
      "geometry": {
        "type": "Point",
        "coordinates": [
          -61.082,
          -22.08586
        ]
      }
    },
    {
      "type": "Feature",
      "properties": {
        "bright_ti4": "367",
        "scan": "0.4",
        "track": "0.45",
        "acq_date": "2021-12-07",
        "acq_time": "1758",
        "satellite": "N",
        "confidence": "high",
        "version": "2.0NRT",
        "bright_ti5": "313.02",
        "frp": "10.49",
        "daynight": "D"
      },
      "geometry": {
        "type": "Point",
        "coordinates": [
          -58.90142,
          -21.58674
        ]
      }
    },
    {
      "type": "Feature",
      "properties": {
        "bright_ti4": "367",
        "scan": "0.46",
        "track": "0.47",
        "acq_date": "2021-12-07",
        "acq_time": "1758",
        "satellite": "N",
        "confidence": "high",
        "version": "2.0NRT",
        "bright_ti5": "310.9",
        "frp": "12.19",
        "daynight": "D"
      },
      "geometry": {
        "type": "Point",
        "coordinates": [
          -58.10141,
          -20.86408
        ]
      }
    },
    {
      "type": "Feature",
      "properties": {
        "bright_ti4": "367",
        "scan": "0.46",
        "track": "0.39",
        "acq_date": "2021-12-07",
        "acq_time": "1758",
        "satellite": "N",
        "confidence": "high",
        "version": "2.0NRT",
        "bright_ti5": "309.72",
        "frp": "13.3",
        "daynight": "D"
      },
      "geometry": {
        "type": "Point",
        "coordinates": [
          -61.23732,
          -21.37194
        ]
      }
    },
    {
      "type": "Feature",
      "properties": {
        "bright_ti4": "367",
        "scan": "0.46",
        "track": "0.39",
        "acq_date": "2021-12-07",
        "acq_time": "1758",
        "satellite": "N",
        "confidence": "high",
        "version": "2.0NRT",
        "bright_ti5": "310.24",
        "frp": "5.87",
        "daynight": "D"
      },
      "geometry": {
        "type": "Point",
        "coordinates": [
          -61.24179,
          -21.37271
        ]
      }
    },
    {
      "type": "Feature",
      "properties": {
        "bright_ti4": "367",
        "scan": "0.48",
        "track": "0.4",
        "acq_date": "2021-12-07",
        "acq_time": "1758",
        "satellite": "N",
        "confidence": "high",
        "version": "2.0NRT",
        "bright_ti5": "312.27",
        "frp": "75.56",
        "daynight": "D"
      },
      "geometry": {
        "type": "Point",
        "coordinates": [
          -61.01362,
          -21.13131
        ]
      }
    },
    {
      "type": "Feature",
      "properties": {
        "bright_ti4": "367",
        "scan": "0.48",
        "track": "0.4",
        "acq_date": "2021-12-07",
        "acq_time": "1758",
        "satellite": "N",
        "confidence": "high",
        "version": "2.0NRT",
        "bright_ti5": "326.64",
        "frp": "75.56",
        "daynight": "D"
      },
      "geometry": {
        "type": "Point",
        "coordinates": [
          -61.01823,
          -21.13211
        ]
      }
    },
    {
      "type": "Feature",
      "properties": {
        "bright_ti4": "367",
        "scan": "0.5",
        "track": "0.66",
        "acq_date": "2021-12-07",
        "acq_time": "1758",
        "satellite": "N",
        "confidence": "high",
        "version": "2.0NRT",
        "bright_ti5": "304.78",
        "frp": "22.92",
        "daynight": "D"
      },
      "geometry": {
        "type": "Point",
        "coordinates": [
          -53.12072,
          -19.46404
        ]
      }
    },
    {
      "type": "Feature",
      "properties": {
        "bright_ti4": "367",
        "scan": "0.5",
        "track": "0.66",
        "acq_date": "2021-12-07",
        "acq_time": "1758",
        "satellite": "N",
        "confidence": "high",
        "version": "2.0NRT",
        "bright_ti5": "307.96",
        "frp": "12.8",
        "daynight": "D"
      },
      "geometry": {
        "type": "Point",
        "coordinates": [
          -53.13032,
          -19.46624
        ]
      }
    },
    {
      "type": "Feature",
      "properties": {
        "bright_ti4": "367",
        "scan": "0.5",
        "track": "0.66",
        "acq_date": "2021-12-07",
        "acq_time": "1758",
        "satellite": "N",
        "confidence": "high",
        "version": "2.0NRT",
        "bright_ti5": "302.01",
        "frp": "12.8",
        "daynight": "D"
      },
      "geometry": {
        "type": "Point",
        "coordinates": [
          -53.13148,
          -19.46011
        ]
      }
    },
    {
      "type": "Feature",
      "properties": {
        "bright_ti4": "367",
        "scan": "0.5",
        "track": "0.66",
        "acq_date": "2021-12-07",
        "acq_time": "1758",
        "satellite": "N",
        "confidence": "high",
        "version": "2.0NRT",
        "bright_ti5": "305.65",
        "frp": "11.24",
        "daynight": "D"
      },
      "geometry": {
        "type": "Point",
        "coordinates": [
          -53.12508,
          -19.46562
        ]
      }
    },
    {
      "type": "Feature",
      "properties": {
        "bright_ti4": "367",
        "scan": "0.5",
        "track": "0.66",
        "acq_date": "2021-12-07",
        "acq_time": "1758",
        "satellite": "N",
        "confidence": "high",
        "version": "2.0NRT",
        "bright_ti5": "306.76",
        "frp": "11.24",
        "daynight": "D"
      },
      "geometry": {
        "type": "Point",
        "coordinates": [
          -53.12988,
          -19.46668
        ]
      }
    },
    {
      "type": "Feature",
      "properties": {
        "bright_ti4": "367",
        "scan": "0.5",
        "track": "0.66",
        "acq_date": "2021-12-07",
        "acq_time": "1758",
        "satellite": "N",
        "confidence": "high",
        "version": "2.0NRT",
        "bright_ti5": "302.39",
        "frp": "11.87",
        "daynight": "D"
      },
      "geometry": {
        "type": "Point",
        "coordinates": [
          -53.13106,
          -19.46056
        ]
      }
    },
    {
      "type": "Feature",
      "properties": {
        "bright_ti4": "367",
        "scan": "0.5",
        "track": "0.66",
        "acq_date": "2021-12-07",
        "acq_time": "1758",
        "satellite": "N",
        "confidence": "high",
        "version": "2.0NRT",
        "bright_ti5": "300.75",
        "frp": "11.18",
        "daynight": "D"
      },
      "geometry": {
        "type": "Point",
        "coordinates": [
          -53.13578,
          -19.46161
        ]
      }
    },
    {
      "type": "Feature",
      "properties": {
        "bright_ti4": "367",
        "scan": "0.43",
        "track": "0.46",
        "acq_date": "2021-12-07",
        "acq_time": "1758",
        "satellite": "N",
        "confidence": "high",
        "version": "2.0NRT",
        "bright_ti5": "334.43",
        "frp": "112.56",
        "daynight": "D"
      },
      "geometry": {
        "type": "Point",
        "coordinates": [
          -58.74523,
          -20.51467
        ]
      }
    },
    {
      "type": "Feature",
      "properties": {
        "bright_ti4": "367",
        "scan": "0.49",
        "track": "0.41",
        "acq_date": "2021-12-07",
        "acq_time": "1758",
        "satellite": "N",
        "confidence": "high",
        "version": "2.0NRT",
        "bright_ti5": "310.49",
        "frp": "12.53",
        "daynight": "D"
      },
      "geometry": {
        "type": "Point",
        "coordinates": [
          -60.81402,
          -20.74841
        ]
      }
    },
    {
      "type": "Feature",
      "properties": {
        "bright_ti4": "367",
        "scan": "0.34",
        "track": "0.56",
        "acq_date": "2021-12-07",
        "acq_time": "1758",
        "satellite": "N",
        "confidence": "high",
        "version": "2.0NRT",
        "bright_ti5": "303.78",
        "frp": "8.04",
        "daynight": "D"
      },
      "geometry": {
        "type": "Point",
        "coordinates": [
          -55.7799,
          -19.50225
        ]
      }
    },
    {
      "type": "Feature",
      "properties": {
        "bright_ti4": "367",
        "scan": "0.35",
        "track": "0.56",
        "acq_date": "2021-12-07",
        "acq_time": "1758",
        "satellite": "N",
        "confidence": "high",
        "version": "2.0NRT",
        "bright_ti5": "305.01",
        "frp": "13.26",
        "daynight": "D"
      },
      "geometry": {
        "type": "Point",
        "coordinates": [
          -55.7227,
          -19.47925
        ]
      }
    },
    {
      "type": "Feature",
      "properties": {
        "bright_ti4": "367",
        "scan": "0.34",
        "track": "0.56",
        "acq_date": "2021-12-07",
        "acq_time": "1758",
        "satellite": "N",
        "confidence": "high",
        "version": "2.0NRT",
        "bright_ti5": "305.1",
        "frp": "6.34",
        "daynight": "D"
      },
      "geometry": {
        "type": "Point",
        "coordinates": [
          -55.77837,
          -19.50169
        ]
      }
    },
    {
      "type": "Feature",
      "properties": {
        "bright_ti4": "367",
        "scan": "0.35",
        "track": "0.56",
        "acq_date": "2021-12-07",
        "acq_time": "1758",
        "satellite": "N",
        "confidence": "high",
        "version": "2.0NRT",
        "bright_ti5": "305.6",
        "frp": "14.36",
        "daynight": "D"
      },
      "geometry": {
        "type": "Point",
        "coordinates": [
          -55.72105,
          -19.4791
        ]
      }
    },
    {
      "type": "Feature",
      "properties": {
        "bright_ti4": "367",
        "scan": "0.35",
        "track": "0.56",
        "acq_date": "2021-12-07",
        "acq_time": "1758",
        "satellite": "N",
        "confidence": "high",
        "version": "2.0NRT",
        "bright_ti5": "304.01",
        "frp": "9.15",
        "daynight": "D"
      },
      "geometry": {
        "type": "Point",
        "coordinates": [
          -55.71219,
          -19.47184
        ]
      }
    },
    {
      "type": "Feature",
      "properties": {
        "bright_ti4": "367",
        "scan": "0.35",
        "track": "0.56",
        "acq_date": "2021-12-07",
        "acq_time": "1758",
        "satellite": "N",
        "confidence": "high",
        "version": "2.0NRT",
        "bright_ti5": "307.21",
        "frp": "9.15",
        "daynight": "D"
      },
      "geometry": {
        "type": "Point",
        "coordinates": [
          -55.71554,
          -19.47253
        ]
      }
    },
    {
      "type": "Feature",
      "properties": {
        "bright_ti4": "367",
        "scan": "0.35",
        "track": "0.56",
        "acq_date": "2021-12-07",
        "acq_time": "1758",
        "satellite": "N",
        "confidence": "high",
        "version": "2.0NRT",
        "bright_ti5": "304.53",
        "frp": "9.15",
        "daynight": "D"
      },
      "geometry": {
        "type": "Point",
        "coordinates": [
          -55.71338,
          -19.46665
        ]
      }
    },
    {
      "type": "Feature",
      "properties": {
        "bright_ti4": "367",
        "scan": "0.42",
        "track": "0.45",
        "acq_date": "2021-12-07",
        "acq_time": "1758",
        "satellite": "N",
        "confidence": "high",
        "version": "2.0NRT",
        "bright_ti5": "307.23",
        "frp": "7.56",
        "daynight": "D"
      },
      "geometry": {
        "type": "Point",
        "coordinates": [
          -59.15847,
          -19.9675
        ]
      }
    },
    {
      "type": "Feature",
      "properties": {
        "bright_ti4": "367",
        "scan": "0.51",
        "track": "0.66",
        "acq_date": "2021-12-07",
        "acq_time": "1758",
        "satellite": "N",
        "confidence": "high",
        "version": "2.0NRT",
        "bright_ti5": "302.71",
        "frp": "12.53",
        "daynight": "D"
      },
      "geometry": {
        "type": "Point",
        "coordinates": [
          -53.45915,
          -18.25055
        ]
      }
    },
    {
      "type": "Feature",
      "properties": {
        "bright_ti4": "367",
        "scan": "0.47",
        "track": "0.39",
        "acq_date": "2021-12-07",
        "acq_time": "1758",
        "satellite": "N",
        "confidence": "high",
        "version": "2.0NRT",
        "bright_ti5": "329.14",
        "frp": "78.45",
        "daynight": "D"
      },
      "geometry": {
        "type": "Point",
        "coordinates": [
          -61.59988,
          -19.75922
        ]
      }
    },
    {
      "type": "Feature",
      "properties": {
        "bright_ti4": "367",
        "scan": "0.62",
        "track": "0.54",
        "acq_date": "2021-12-07",
        "acq_time": "1758",
        "satellite": "N",
        "confidence": "high",
        "version": "2.0NRT",
        "bright_ti5": "306.95",
        "frp": "20.03",
        "daynight": "D"
      },
      "geometry": {
        "type": "Point",
        "coordinates": [
          -56.9273,
          -18.09225
        ]
      }
    },
    {
      "type": "Feature",
      "properties": {
        "bright_ti4": "367",
        "scan": "0.62",
        "track": "0.54",
        "acq_date": "2021-12-07",
        "acq_time": "1758",
        "satellite": "N",
        "confidence": "high",
        "version": "2.0NRT",
        "bright_ti5": "305.96",
        "frp": "10.76",
        "daynight": "D"
      },
      "geometry": {
        "type": "Point",
        "coordinates": [
          -56.93902,
          -18.09465
        ]
      }
    },
    {
      "type": "Feature",
      "properties": {
        "bright_ti4": "367",
        "scan": "0.62",
        "track": "0.54",
        "acq_date": "2021-12-07",
        "acq_time": "1758",
        "satellite": "N",
        "confidence": "high",
        "version": "2.0NRT",
        "bright_ti5": "303.98",
        "frp": "12.66",
        "daynight": "D"
      },
      "geometry": {
        "type": "Point",
        "coordinates": [
          -56.9243,
          -18.09175
        ]
      }
    },
    {
      "type": "Feature",
      "properties": {
        "bright_ti4": "367",
        "scan": "0.62",
        "track": "0.54",
        "acq_date": "2021-12-07",
        "acq_time": "1758",
        "satellite": "N",
        "confidence": "high",
        "version": "2.0NRT",
        "bright_ti5": "305.97",
        "frp": "12.66",
        "daynight": "D"
      },
      "geometry": {
        "type": "Point",
        "coordinates": [
          -56.93018,
          -18.09291
        ]
      }
    },
    {
      "type": "Feature",
      "properties": {
        "bright_ti4": "367",
        "scan": "0.44",
        "track": "0.38",
        "acq_date": "2021-12-07",
        "acq_time": "1758",
        "satellite": "N",
        "confidence": "high",
        "version": "2.0NRT",
        "bright_ti5": "305.03",
        "frp": "11.65",
        "daynight": "D"
      },
      "geometry": {
        "type": "Point",
        "coordinates": [
          -62.71986,
          -17.73177
        ]
      }
    },
    {
      "type": "Feature",
      "properties": {
        "bright_ti4": "367",
        "scan": "0.44",
        "track": "0.38",
        "acq_date": "2021-12-07",
        "acq_time": "1758",
        "satellite": "N",
        "confidence": "high",
        "version": "2.0NRT",
        "bright_ti5": "305.17",
        "frp": "11.65",
        "daynight": "D"
      },
      "geometry": {
        "type": "Point",
        "coordinates": [
          -62.72402,
          -17.73245
        ]
      }
    },
    {
      "type": "Feature",
      "properties": {
        "bright_ti4": "367",
        "scan": "0.54",
        "track": "0.42",
        "acq_date": "2021-12-07",
        "acq_time": "1758",
        "satellite": "N",
        "confidence": "high",
        "version": "2.0NRT",
        "bright_ti5": "303.57",
        "frp": "39.38",
        "daynight": "D"
      },
      "geometry": {
        "type": "Point",
        "coordinates": [
          -61.03615,
          -17.35777
        ]
      }
    },
    {
      "type": "Feature",
      "properties": {
        "bright_ti4": "367",
        "scan": "0.54",
        "track": "0.42",
        "acq_date": "2021-12-07",
        "acq_time": "1758",
        "satellite": "N",
        "confidence": "high",
        "version": "2.0NRT",
        "bright_ti5": "303.07",
        "frp": "20.91",
        "daynight": "D"
      },
      "geometry": {
        "type": "Point",
        "coordinates": [
          -61.04119,
          -17.35868
        ]
      }
    },
    {
      "type": "Feature",
      "properties": {
        "bright_ti4": "367",
        "scan": "0.54",
        "track": "0.42",
        "acq_date": "2021-12-07",
        "acq_time": "1758",
        "satellite": "N",
        "confidence": "high",
        "version": "2.0NRT",
        "bright_ti5": "301.02",
        "frp": "20.91",
        "daynight": "D"
      },
      "geometry": {
        "type": "Point",
        "coordinates": [
          -61.04181,
          -17.35479
        ]
      }
    },
    {
      "type": "Feature",
      "properties": {
        "bright_ti4": "367",
        "scan": "0.54",
        "track": "0.42",
        "acq_date": "2021-12-07",
        "acq_time": "1758",
        "satellite": "N",
        "confidence": "high",
        "version": "2.0NRT",
        "bright_ti5": "304.17",
        "frp": "19.88",
        "daynight": "D"
      },
      "geometry": {
        "type": "Point",
        "coordinates": [
          -61.0385,
          -17.35812
        ]
      }
    },
    {
      "type": "Feature",
      "properties": {
        "bright_ti4": "367",
        "scan": "0.34",
        "track": "0.56",
        "acq_date": "2021-12-07",
        "acq_time": "1758",
        "satellite": "N",
        "confidence": "high",
        "version": "2.0NRT",
        "bright_ti5": "296.26",
        "frp": "9.78",
        "daynight": "D"
      },
      "geometry": {
        "type": "Point",
        "coordinates": [
          -56.70628,
          -16.34474
        ]
      }
    },
    {
      "type": "Feature",
      "properties": {
        "bright_ti4": "367",
        "scan": "0.49",
        "track": "0.4",
        "acq_date": "2021-12-07",
        "acq_time": "1758",
        "satellite": "N",
        "confidence": "high",
        "version": "2.0NRT",
        "bright_ti5": "299.14",
        "frp": "28.32",
        "daynight": "D"
      },
      "geometry": {
        "type": "Point",
        "coordinates": [
          -62.133,
          -16.31518
        ]
      }
    },
    {
      "type": "Feature",
      "properties": {
        "bright_ti4": "367",
        "scan": "0.35",
        "track": "0.56",
        "acq_date": "2021-12-07",
        "acq_time": "1800",
        "satellite": "N",
        "confidence": "high",
        "version": "2.0NRT",
        "bright_ti5": "294.78",
        "frp": "10.04",
        "daynight": "D"
      },
      "geometry": {
        "type": "Point",
        "coordinates": [
          -57.23705,
          -14.38548
        ]
      }
    },
    {
      "type": "Feature",
      "properties": {
        "bright_ti4": "367",
        "scan": "0.52",
        "track": "0.66",
        "acq_date": "2021-12-07",
        "acq_time": "1804",
        "satellite": "N",
        "confidence": "high",
        "version": "2.0NRT",
        "bright_ti5": "295.81",
        "frp": "45.96",
        "daynight": "D"
      },
      "geometry": {
        "type": "Point",
        "coordinates": [
          -79.91093,
          -4.10682
        ]
      }
    },
    {
      "type": "Feature",
      "properties": {
        "bright_ti4": "367",
        "scan": "0.41",
        "track": "0.37",
        "acq_date": "2021-12-07",
        "acq_time": "1804",
        "satellite": "N",
        "confidence": "high",
        "version": "2.0NRT",
        "bright_ti5": "297.49",
        "frp": "7.41",
        "daynight": "D"
      },
      "geometry": {
        "type": "Point",
        "coordinates": [
          -72.21301,
          3.56324
        ]
      }
    },
    {
      "type": "Feature",
      "properties": {
        "bright_ti4": "367",
        "scan": "0.43",
        "track": "0.38",
        "acq_date": "2021-12-08",
        "acq_time": "0508",
        "satellite": "N",
        "confidence": "high",
        "version": "2.0NRT",
        "bright_ti5": "292.46",
        "frp": "7.47",
        "daynight": "N"
      },
      "geometry": {
        "type": "Point",
        "coordinates": [
          -60.75931,
          -16.60799
        ]
      }
    },
    {
      "type": "Feature",
      "properties": {
        "bright_ti4": "367",
        "scan": "0.44",
        "track": "0.46",
        "acq_date": "2021-12-08",
        "acq_time": "0510",
        "satellite": "N",
        "confidence": "high",
        "version": "2.0NRT",
        "bright_ti5": "294.49",
        "frp": "5.59",
        "daynight": "N"
      },
      "geometry": {
        "type": "Point",
        "coordinates": [
          -53.56744,
          -22.89142
        ]
      }
    },
    {
      "type": "Feature",
      "properties": {
        "bright_ti4": "367",
        "scan": "0.44",
        "track": "0.46",
        "acq_date": "2021-12-08",
        "acq_time": "0510",
        "satellite": "N",
        "confidence": "high",
        "version": "2.0NRT",
        "bright_ti5": "293.32",
        "frp": "9.24",
        "daynight": "N"
      },
      "geometry": {
        "type": "Point",
        "coordinates": [
          -53.56683,
          -22.89406
        ]
      }
    },
    {
      "type": "Feature",
      "properties": {
        "bright_ti4": "367",
        "scan": "0.49",
        "track": "0.48",
        "acq_date": "2021-12-08",
        "acq_time": "0514",
        "satellite": "N",
        "confidence": "high",
        "version": "2.0NRT",
        "bright_ti5": "289.6",
        "frp": "20.52",
        "daynight": "N"
      },
      "geometry": {
        "type": "Point",
        "coordinates": [
          -72.74697,
          -38.34762
        ]
      }
    },
    {
      "type": "Feature",
      "properties": {
        "bright_ti4": "367",
        "scan": "0.63",
        "track": "0.72",
        "acq_date": "2021-12-08",
        "acq_time": "0501",
        "satellite": "N",
        "confidence": "high",
        "version": "2.0NRT",
        "bright_ti5": "288.48",
        "frp": "12.49",
        "daynight": "N"
      },
      "geometry": {
        "type": "Point",
        "coordinates": [
          -64.89053,
          10.06139
        ]
      }
    },
    {
      "type": "Feature",
      "properties": {
        "bright_ti4": "367",
        "scan": "0.62",
        "track": "0.72",
        "acq_date": "2021-12-08",
        "acq_time": "0501",
        "satellite": "N",
        "confidence": "high",
        "version": "2.0NRT",
        "bright_ti5": "288.38",
        "frp": "11.5",
        "daynight": "N"
      },
      "geometry": {
        "type": "Point",
        "coordinates": [
          -64.8727,
          10.0593
        ]
      }
    },
    {
      "type": "Feature",
      "properties": {
        "bright_ti4": "367",
        "scan": "0.62",
        "track": "0.72",
        "acq_date": "2021-12-08",
        "acq_time": "0501",
        "satellite": "N",
        "confidence": "high",
        "version": "2.0NRT",
        "bright_ti5": "289.13",
        "frp": "27.65",
        "daynight": "N"
      },
      "geometry": {
        "type": "Point",
        "coordinates": [
          -64.89001,
          10.05807
        ]
      }
    },
    {
      "type": "Feature",
      "properties": {
        "bright_ti4": "367",
        "scan": "0.62",
        "track": "0.72",
        "acq_date": "2021-12-08",
        "acq_time": "0501",
        "satellite": "N",
        "confidence": "high",
        "version": "2.0NRT",
        "bright_ti5": "288.53",
        "frp": "15.31",
        "daynight": "N"
      },
      "geometry": {
        "type": "Point",
        "coordinates": [
          -64.87189,
          10.05583
        ]
      }
    },
    {
      "type": "Feature",
      "properties": {
        "bright_ti4": "367",
        "scan": "0.5",
        "track": "0.66",
        "acq_date": "2021-12-08",
        "acq_time": "0501",
        "satellite": "N",
        "confidence": "high",
        "version": "2.0NRT",
        "bright_ti5": "290.01",
        "frp": "8.82",
        "daynight": "N"
      },
      "geometry": {
        "type": "Point",
        "coordinates": [
          -63.47625,
          9.73646
        ]
      }
    },
    {
      "type": "Feature",
      "properties": {
        "bright_ti4": "367",
        "scan": "0.5",
        "track": "0.66",
        "acq_date": "2021-12-08",
        "acq_time": "0501",
        "satellite": "N",
        "confidence": "high",
        "version": "2.0NRT",
        "bright_ti5": "290.83",
        "frp": "7.33",
        "daynight": "N"
      },
      "geometry": {
        "type": "Point",
        "coordinates": [
          -63.46326,
          9.72863
        ]
      }
    },
    {
      "type": "Feature",
      "properties": {
        "bright_ti4": "367",
        "scan": "0.5",
        "track": "0.66",
        "acq_date": "2021-12-08",
        "acq_time": "0501",
        "satellite": "N",
        "confidence": "high",
        "version": "2.0NRT",
        "bright_ti5": "289.72",
        "frp": "7.79",
        "daynight": "N"
      },
      "geometry": {
        "type": "Point",
        "coordinates": [
          -63.56673,
          9.6545
        ]
      }
    },
    {
      "type": "Feature",
      "properties": {
        "bright_ti4": "367",
        "scan": "0.5",
        "track": "0.66",
        "acq_date": "2021-12-08",
        "acq_time": "0501",
        "satellite": "N",
        "confidence": "high",
        "version": "2.0NRT",
        "bright_ti5": "288.47",
        "frp": "5.71",
        "daynight": "N"
      },
      "geometry": {
        "type": "Point",
        "coordinates": [
          -63.53888,
          9.65116
        ]
      }
    },
    {
      "type": "Feature",
      "properties": {
        "bright_ti4": "367",
        "scan": "0.5",
        "track": "0.66",
        "acq_date": "2021-12-08",
        "acq_time": "0501",
        "satellite": "N",
        "confidence": "high",
        "version": "2.0NRT",
        "bright_ti5": "287.44",
        "frp": "8.34",
        "daynight": "N"
      },
      "geometry": {
        "type": "Point",
        "coordinates": [
          -63.57251,
          9.64898
        ]
      }
    },
    {
      "type": "Feature",
      "properties": {
        "bright_ti4": "367",
        "scan": "0.5",
        "track": "0.66",
        "acq_date": "2021-12-08",
        "acq_time": "0501",
        "satellite": "N",
        "confidence": "high",
        "version": "2.0NRT",
        "bright_ti5": "286.97",
        "frp": "7.79",
        "daynight": "N"
      },
      "geometry": {
        "type": "Point",
        "coordinates": [
          -63.56782,
          9.64841
        ]
      }
    },
    {
      "type": "Feature",
      "properties": {
        "bright_ti4": "367",
        "scan": "0.5",
        "track": "0.66",
        "acq_date": "2021-12-08",
        "acq_time": "0501",
        "satellite": "N",
        "confidence": "high",
        "version": "2.0NRT",
        "bright_ti5": "287.99",
        "frp": "15.89",
        "daynight": "N"
      },
      "geometry": {
        "type": "Point",
        "coordinates": [
          -63.56744,
          9.65507
        ]
      }
    },
    {
      "type": "Feature",
      "properties": {
        "bright_ti4": "367",
        "scan": "0.5",
        "track": "0.66",
        "acq_date": "2021-12-08",
        "acq_time": "0501",
        "satellite": "N",
        "confidence": "high",
        "version": "2.0NRT",
        "bright_ti5": "287.77",
        "frp": "10.32",
        "daynight": "N"
      },
      "geometry": {
        "type": "Point",
        "coordinates": [
          -63.53968,
          9.65153
        ]
      }
    },
    {
      "type": "Feature",
      "properties": {
        "bright_ti4": "367",
        "scan": "0.51",
        "track": "0.66",
        "acq_date": "2021-12-08",
        "acq_time": "0501",
        "satellite": "N",
        "confidence": "high",
        "version": "2.0NRT",
        "bright_ti5": "289.86",
        "frp": "39.96",
        "daynight": "N"
      },
      "geometry": {
        "type": "Point",
        "coordinates": [
          -63.62492,
          9.65614
        ]
      }
    },
    {
      "type": "Feature",
      "properties": {
        "bright_ti4": "367",
        "scan": "0.5",
        "track": "0.66",
        "acq_date": "2021-12-08",
        "acq_time": "0501",
        "satellite": "N",
        "confidence": "high",
        "version": "2.0NRT",
        "bright_ti5": "287.83",
        "frp": "11.7",
        "daynight": "N"
      },
      "geometry": {
        "type": "Point",
        "coordinates": [
          -63.57319,
          9.64957
        ]
      }
    },
    {
      "type": "Feature",
      "properties": {
        "bright_ti4": "367",
        "scan": "0.5",
        "track": "0.66",
        "acq_date": "2021-12-08",
        "acq_time": "0501",
        "satellite": "N",
        "confidence": "high",
        "version": "2.0NRT",
        "bright_ti5": "287.32",
        "frp": "11.7",
        "daynight": "N"
      },
      "geometry": {
        "type": "Point",
        "coordinates": [
          -63.56852,
          9.64898
        ]
      }
    },
    {
      "type": "Feature",
      "properties": {
        "bright_ti4": "367",
        "scan": "0.51",
        "track": "0.66",
        "acq_date": "2021-12-08",
        "acq_time": "0501",
        "satellite": "N",
        "confidence": "high",
        "version": "2.0NRT",
        "bright_ti5": "289.96",
        "frp": "39.96",
        "daynight": "N"
      },
      "geometry": {
        "type": "Point",
        "coordinates": [
          -63.63069,
          9.65062
        ]
      }
    },
    {
      "type": "Feature",
      "properties": {
        "bright_ti4": "367",
        "scan": "0.5",
        "track": "0.66",
        "acq_date": "2021-12-08",
        "acq_time": "0501",
        "satellite": "N",
        "confidence": "high",
        "version": "2.0NRT",
        "bright_ti5": "289.46",
        "frp": "16.96",
        "daynight": "N"
      },
      "geometry": {
        "type": "Point",
        "coordinates": [
          -63.5649,
          9.6423
        ]
      }
    },
    {
      "type": "Feature",
      "properties": {
        "bright_ti4": "367",
        "scan": "0.5",
        "track": "0.66",
        "acq_date": "2021-12-08",
        "acq_time": "0501",
        "satellite": "N",
        "confidence": "high",
        "version": "2.0NRT",
        "bright_ti5": "286.99",
        "frp": "16.96",
        "daynight": "N"
      },
      "geometry": {
        "type": "Point",
        "coordinates": [
          -63.56025,
          9.64171
        ]
      }
    },
    {
      "type": "Feature",
      "properties": {
        "bright_ti4": "367",
        "scan": "0.51",
        "track": "0.66",
        "acq_date": "2021-12-08",
        "acq_time": "0501",
        "satellite": "N",
        "confidence": "high",
        "version": "2.0NRT",
        "bright_ti5": "285.49",
        "frp": "12.73",
        "daynight": "N"
      },
      "geometry": {
        "type": "Point",
        "coordinates": [
          -63.63213,
          9.56339
        ]
      }
    },
    {
      "type": "Feature",
      "properties": {
        "bright_ti4": "367",
        "scan": "0.51",
        "track": "0.66",
        "acq_date": "2021-12-08",
        "acq_time": "0501",
        "satellite": "N",
        "confidence": "high",
        "version": "2.0NRT",
        "bright_ti5": "285.75",
        "frp": "12.99",
        "daynight": "N"
      },
      "geometry": {
        "type": "Point",
        "coordinates": [
          -63.63163,
          9.56359
        ]
      }
    },
    {
      "type": "Feature",
      "properties": {
        "bright_ti4": "367",
        "scan": "0.63",
        "track": "0.72",
        "acq_date": "2021-12-08",
        "acq_time": "0641",
        "satellite": "N",
        "confidence": "high",
        "version": "2.0NRT",
        "bright_ti5": "289.74",
        "frp": "14.24",
        "daynight": "N"
      },
      "geometry": {
        "type": "Point",
        "coordinates": [
          -64.8852,
          10.0595
        ]
      }
    },
    {
      "type": "Feature",
      "properties": {
        "bright_ti4": "367",
        "scan": "0.63",
        "track": "0.72",
        "acq_date": "2021-12-08",
        "acq_time": "0641",
        "satellite": "N",
        "confidence": "high",
        "version": "2.0NRT",
        "bright_ti5": "292.67",
        "frp": "13.01",
        "daynight": "N"
      },
      "geometry": {
        "type": "Point",
        "coordinates": [
          -64.86848,
          10.05619
        ]
      }
    },
    {
      "type": "Feature",
      "properties": {
        "bright_ti4": "367",
        "scan": "0.78",
        "track": "0.78",
        "acq_date": "2021-12-08",
        "acq_time": "0641",
        "satellite": "N",
        "confidence": "high",
        "version": "2.0NRT",
        "bright_ti5": "280.91",
        "frp": "16.39",
        "daynight": "N"
      },
      "geometry": {
        "type": "Point",
        "coordinates": [
          -63.56427,
          9.65264
        ]
      }
    },
    {
      "type": "Feature",
      "properties": {
        "bright_ti4": "367",
        "scan": "0.78",
        "track": "0.78",
        "acq_date": "2021-12-08",
        "acq_time": "0641",
        "satellite": "N",
        "confidence": "high",
        "version": "2.0NRT",
        "bright_ti5": "285.21",
        "frp": "16.39",
        "daynight": "N"
      },
      "geometry": {
        "type": "Point",
        "coordinates": [
          -63.56535,
          9.64543
        ]
      }
    },
    {
      "type": "Feature",
      "properties": {
        "bright_ti4": "367",
        "scan": "0.77",
        "track": "0.77",
        "acq_date": "2021-12-08",
        "acq_time": "0641",
        "satellite": "N",
        "confidence": "high",
        "version": "2.0NRT",
        "bright_ti5": "286.69",
        "frp": "46.44",
        "daynight": "N"
      },
      "geometry": {
        "type": "Point",
        "coordinates": [
          -63.63155,
          9.65153
        ]
      }
    },
    {
      "type": "Feature",
      "properties": {
        "bright_ti4": "367",
        "scan": "0.77",
        "track": "0.77",
        "acq_date": "2021-12-08",
        "acq_time": "0641",
        "satellite": "N",
        "confidence": "high",
        "version": "2.0NRT",
        "bright_ti5": "287.28",
        "frp": "57.03",
        "daynight": "N"
      },
      "geometry": {
        "type": "Point",
        "coordinates": [
          -63.62633,
          9.65474
        ]
      }
    },
    {
      "type": "Feature",
      "properties": {
        "bright_ti4": "367",
        "scan": "0.78",
        "track": "0.78",
        "acq_date": "2021-12-08",
        "acq_time": "0641",
        "satellite": "N",
        "confidence": "high",
        "version": "2.0NRT",
        "bright_ti5": "283.37",
        "frp": "21.06",
        "daynight": "N"
      },
      "geometry": {
        "type": "Point",
        "coordinates": [
          -63.561,
          9.64183
        ]
      }
    },
    {
      "type": "Feature",
      "properties": {
        "bright_ti4": "367",
        "scan": "0.77",
        "track": "0.77",
        "acq_date": "2021-12-08",
        "acq_time": "0641",
        "satellite": "N",
        "confidence": "high",
        "version": "2.0NRT",
        "bright_ti5": "286.03",
        "frp": "10.29",
        "daynight": "N"
      },
      "geometry": {
        "type": "Point",
        "coordinates": [
          -63.62756,
          9.64758
        ]
      }
    },
    {
      "type": "Feature",
      "properties": {
        "bright_ti4": "367",
        "scan": "0.76",
        "track": "0.77",
        "acq_date": "2021-12-08",
        "acq_time": "0641",
        "satellite": "N",
        "confidence": "high",
        "version": "2.0NRT",
        "bright_ti5": "289.78",
        "frp": "21.34",
        "daynight": "N"
      },
      "geometry": {
        "type": "Point",
        "coordinates": [
          -63.72359,
          9.62238
        ]
      }
    }
  ]
}
