{
   "type": "FeatureCollection",
   "features": [
  {
    "type": "Feature",
    "geometry": {
       "type": "Point",
       "coordinates":  [ -55.53936,-27.26741 ]
    },
    "properties": {
    "Nombre":"Axion",
    "Localidad":"",
    "Calle":"",
    "Numero":"",
    "CodigoPostal":"",
    "Marca":"Axion",
    "Operador":"LOS CERRITOS S.A.",
    "Telefono":"",
    "OSM":272175275
    }
  },
  {
    "type": "Feature",
    "geometry": {
       "type": "Point",
       "coordinates":  [ -55.5758613,-27.3779452 ]
    },
    "properties": {
    "Nombre":"YPF",
    "Localidad":"",
    "Calle":"",
    "Numero":"",
    "CodigoPostal":"",
    "Marca":"YPF",
    "Operador":"ADOLFO SARTORI SA",
    "Telefono":"",
    "OSM":272175287
    }
  },
  {
    "type": "Feature",
    "geometry": {
       "type": "Point",
       "coordinates":  [ -55.7454577,-27.4716398 ]
    },
    "properties": {
    "Nombre":"YPF",
    "Localidad":"",
    "Calle":"",
    "Numero":"",
    "CodigoPostal":"",
    "Marca":"YPF",
    "Operador":"MARCELO SALOMON AMIEL",
    "Telefono":"",
    "OSM":272175304
    }
  },
  {
    "type": "Feature",
    "geometry": {
       "type": "Point",
       "coordinates":  [ -55.8976466,-27.3711058 ]
    },
    "properties": {
    "Nombre":"Shell",
    "Localidad":"",
    "Calle":"",
    "Numero":"",
    "CodigoPostal":"",
    "Marca":"Shell",
    "Operador":"EMPRENDIMIENTOS CATARATAS SRL",
    "Telefono":"",
    "OSM":272175337
    }
  },
  {
    "type": "Feature",
    "geometry": {
       "type": "Point",
       "coordinates":  [ -54.5755236,-25.9205557 ]
    },
    "properties": {
    "Nombre":"Shell",
    "Localidad":"",
    "Calle":"",
    "Numero":"",
    "CodigoPostal":"",
    "Marca":"Shell",
    "Operador":"EJE S.A.",
    "Telefono":"",
    "OSM":272175358
    }
  },
  {
    "type": "Feature",
    "geometry": {
       "type": "Point",
       "coordinates":  [ -54.56256,-25.60448 ]
    },
    "properties": {
    "Nombre":"YPF",
    "Localidad":"",
    "Calle":"",
    "Numero":"",
    "CodigoPostal":"",
    "Marca":"YPF",
    "Operador":"OPESSA PUERTO IGUAZU",
    "Telefono":"",
    "OSM":272175368
    }
  },
  {
    "type": "Feature",
    "geometry": {
       "type": "Point",
       "coordinates":  [ -54.5590016,-25.6153507 ]
    },
    "properties": {
    "Nombre":"YPF",
    "Localidad":"",
    "Calle":"",
    "Numero":"",
    "CodigoPostal":"",
    "Marca":"YPF",
    "Operador":"ACA Puerto Iguazú",
    "Telefono":"",
    "OSM":272175372
    }
  },
  {
    "type": "Feature",
    "geometry": {
       "type": "Point",
       "coordinates":  [ -54.7535952,-26.5694336 ]
    },
    "properties": {
    "Nombre":"YPF",
    "Localidad":"Montecarlo",
    "Calle":"Avenida El Libertador",
    "Numero":"",
    "CodigoPostal":3384,
    "Marca":"YPF",
    "Operador":"COOPERATIVA AGRICOLA MIXTA MONTE CARLO LTD",
    "Telefono":"+54 3751 480053",
    "OSM":272175972
    }
  },
  {
    "type": "Feature",
    "geometry": {
       "type": "Point",
       "coordinates":  [ -54.7520955,-27.3686518 ]
    },
    "properties": {
    "Nombre":"",
    "Localidad":"",
    "Calle":"",
    "Numero":"",
    "CodigoPostal":"",
    "Marca":"Axion",
    "Operador":"SUCESION DE LABANDOCZKA MIGUEL CARLOS",
    "Telefono":"",
    "OSM":272175988
    }
  },
  {
    "type": "Feature",
    "geometry": {
       "type": "Point",
       "coordinates":  [ -55.0230483,-26.8213177 ]
    },
    "properties": {
    "Nombre":"YPF",
    "Localidad":"Puerto Rico",
    "Calle":"Virreinato del Rio de la Plata",
    "Numero":"",
    "CodigoPostal":3334,
    "Marca":"YPF",
    "Operador":"EL GUAEMBE SRL",
    "Telefono":"",
    "OSM":272175995
    }
  },
  {
    "type": "Feature",
    "geometry": {
       "type": "Point",
       "coordinates":  [ -54.8320369,-27.0855278 ]
    },
    "properties": {
    "Nombre":"YPF",
    "Localidad":"",
    "Calle":"",
    "Numero":"",
    "CodigoPostal":"",
    "Marca":"YPF",
    "Operador":"PETROVALLE SA",
    "Telefono":"",
    "OSM":272176007
    }
  },
  {
    "type": "Feature",
    "geometry": {
       "type": "Point",
       "coordinates":  [ -54.8933771,-27.0951779 ]
    },
    "properties": {
    "Nombre":"YPF",
    "Localidad":"",
    "Calle":"",
    "Numero":"",
    "CodigoPostal":"",
    "Marca":"YPF",
    "Operador":"PETROVALLE SA",
    "Telefono":"",
    "OSM":272176020
    }
  },
  {
    "type": "Feature",
    "geometry": {
       "type": "Point",
       "coordinates":  [ -55.12546,-27.4873 ]
    },
    "properties": {
    "Nombre":"Axion",
    "Localidad":"",
    "Calle":"",
    "Numero":"",
    "CodigoPostal":"",
    "Marca":"Axion",
    "Operador":"SERVICENTROS OBERA S.A.",
    "Telefono":"",
    "OSM":272176024
    }
  },
  {
    "type": "Feature",
    "geometry": {
       "type": "Point",
       "coordinates":  [ -55.1228638,-27.485675 ]
    },
    "properties": {
    "Nombre":"Shell",
    "Localidad":"",
    "Calle":"",
    "Numero":"",
    "CodigoPostal":"",
    "Marca":"Shell",
    "Operador":"SAND Y ALBRECHTSEN SACIF. E I. - 145",
    "Telefono":"",
    "OSM":272176029
    }
  },
  {
    "type": "Feature",
    "geometry": {
       "type": "Point",
       "coordinates":  [ -54.9716375,-27.2190215 ]
    },
    "properties": {
    "Nombre":"Petrovalle",
    "Localidad":"",
    "Calle":"",
    "Numero":"",
    "CodigoPostal":"",
    "Marca":"Bandera Blanca",
    "Operador":"PETROVALLE SOCIEDAD ANONIMA",
    "Telefono":"",
    "OSM":272176050
    }
  },
  {
    "type": "Feature",
    "geometry": {
       "type": "Point",
       "coordinates":  [ -54.57068,-25.597955 ]
    },
    "properties": {
    "Nombre":"Shell",
    "Localidad":"",
    "Calle":"",
    "Numero":"",
    "CodigoPostal":"",
    "Marca":"Shell",
    "Operador":"RENTACAR IGUAZU SRL",
    "Telefono":"",
    "OSM":308478892
    }
  },
  {
    "type": "Feature",
    "geometry": {
       "type": "Point",
       "coordinates":  [ -55.1343113,-27.8702897 ]
    },
    "properties": {
    "Nombre":"YPF",
    "Localidad":"",
    "Calle":"",
    "Numero":"",
    "CodigoPostal":"",
    "Marca":"YPF",
    "Operador":"SAN JAVIER COMBUSTIBLES SA",
    "Telefono":"",
    "OSM":457868579
    }
  },
  {
    "type": "Feature",
    "geometry": {
       "type": "Point",
       "coordinates":  [ -55.3268323,-27.611381 ]
    },
    "properties": {
    "Nombre":"YPF",
    "Localidad":"",
    "Calle":"",
    "Numero":"",
    "CodigoPostal":"",
    "Marca":"YPF",
    "Operador":"ADOLFO SARTORI SA",
    "Telefono":"",
    "OSM":479794902
    }
  },
  {
    "type": "Feature",
    "geometry": {
       "type": "Point",
       "coordinates":  [ -54.97253,-27.22069 ]
    },
    "properties": {
    "Nombre":"Oil",
    "Localidad":"",
    "Calle":"",
    "Numero":"",
    "CodigoPostal":"",
    "Marca":"Oil",
    "Operador":"SCHOLLES OMAR ALBERTO",
    "Telefono":"",
    "OSM":809083285
    }
  },
  {
    "type": "Feature",
    "geometry": {
       "type": "Point",
       "coordinates":  [ -54.5014435,-27.0043832 ]
    },
    "properties": {
    "Nombre":"YPF",
    "Localidad":"San Vicente",
    "Calle":"",
    "Numero":"",
    "CodigoPostal":"",
    "Marca":"YPF",
    "Operador":"PETROVALLE SA",
    "Telefono":"",
    "OSM":811261405
    }
  },
  {
    "type": "Feature",
    "geometry": {
       "type": "Point",
       "coordinates":  [ -55.756528,-27.917119 ]
    },
    "properties": {
    "Nombre":"Axion",
    "Localidad":"",
    "Calle":"",
    "Numero":"",
    "CodigoPostal":"",
    "Marca":"Axion",
    "Operador":"PUERTA S.A.",
    "Telefono":"",
    "OSM":822183915
    }
  },
  {
    "type": "Feature",
    "geometry": {
       "type": "Point",
       "coordinates":  [ -54.1140599,-26.6252734 ]
    },
    "properties": {
    "Nombre":"YPF",
    "Localidad":"",
    "Calle":"",
    "Numero":"",
    "CodigoPostal":"",
    "Marca":"YPF",
    "Operador":"PETROVALLE SA",
    "Telefono":"",
    "OSM":871077939
    }
  },
  {
    "type": "Feature",
    "geometry": {
       "type": "Point",
       "coordinates":  [ -54.4943326,-27.0000982 ]
    },
    "properties": {
    "Nombre":"Axion",
    "Localidad":"",
    "Calle":"",
    "Numero":"",
    "CodigoPostal":"",
    "Marca":"Axion",
    "Operador":"SCHOLLES OMAR ALBERTO",
    "Telefono":"",
    "OSM":1488712546
    }
  },
  {
    "type": "Feature",
    "geometry": {
       "type": "Point",
       "coordinates":  [ -54.488474,-26.9911038 ]
    },
    "properties": {
    "Nombre":"Shell",
    "Localidad":"",
    "Calle":"",
    "Numero":"",
    "CodigoPostal":"",
    "Marca":"Shell",
    "Operador":"COMB.Y LUB.SAN VICENTE S.R.L.",
    "Telefono":"",
    "OSM":1488724893
    }
  },
  {
    "type": "Feature",
    "geometry": {
       "type": "Point",
       "coordinates":  [ -55.7384,-27.9152 ]
    },
    "properties": {
    "Nombre":"YPF",
    "Localidad":"",
    "Calle":"",
    "Numero":"",
    "CodigoPostal":"",
    "Marca":"YPF",
    "Operador":"DOS MIL SA",
    "Telefono":"",
    "OSM":1588641645
    }
  },
  {
    "type": "Feature",
    "geometry": {
       "type": "Point",
       "coordinates":  [ -54.9580128,-26.8202375 ]
    },
    "properties": {
    "Nombre":"YPF",
    "Localidad":"",
    "Calle":"",
    "Numero":"",
    "CodigoPostal":"",
    "Marca":"YPF",
    "Operador":"ARNO SEEWALD SA",
    "Telefono":"",
    "OSM":1613140451
    }
  },
  {
    "type": "Feature",
    "geometry": {
       "type": "Point",
       "coordinates":  [ -55.9118683,-27.3726608 ]
    },
    "properties": {
    "Nombre":"YPF",
    "Localidad":"Posadas",
    "Calle":"Avenida López y Planes",
    "Numero":3524,
    "CodigoPostal":"",
    "Marca":"YPF",
    "Operador":"RAUL E ALONSO SRL",
    "Telefono":"+54 376 4431231",
    "OSM":1924462684
    }
  },
  {
    "type": "Feature",
    "geometry": {
       "type": "Point",
       "coordinates":  [ -55.1401298,-27.8645408 ]
    },
    "properties": {
    "Nombre":"Vía Marte",
    "Localidad":"",
    "Calle":"",
    "Numero":"",
    "CodigoPostal":"",
    "Marca":"Bandera Blanca",
    "Operador":"",
    "Telefono":"",
    "OSM":1933049628
    }
  },
  {
    "type": "Feature",
    "geometry": {
       "type": "Point",
       "coordinates":  [ -55.9006733,-27.3912163 ]
    },
    "properties": {
    "Nombre":"YPF",
    "Localidad":"Posadas",
    "Calle":"Avenida Uruguay",
    "Numero":4651,
    "CodigoPostal":3300,
    "Marca":"YPF",
    "Operador":"PETROVALLE SA",
    "Telefono":"",
    "OSM":1943264343
    }
  },
  {
    "type": "Feature",
    "geometry": {
       "type": "Point",
       "coordinates":  [ -55.9024922,-27.401425 ]
    },
    "properties": {
    "Nombre":"Shell",
    "Localidad":"Posadas",
    "Calle":"Avenida Uruguay",
    "Numero":"",
    "CodigoPostal":"",
    "Marca":"Shell",
    "Operador":"SERVICIOS DEL LITORAL S.A.",
    "Telefono":"",
    "OSM":1943289724
    }
  },
  {
    "type": "Feature",
    "geometry": {
       "type": "Point",
       "coordinates":  [ -55.908746,-27.391452 ]
    },
    "properties": {
    "Nombre":"Shell",
    "Localidad":"Posadas",
    "Calle":"Avenida Lavalle",
    "Numero":4728,
    "CodigoPostal":3300,
    "Marca":"Shell",
    "Operador":"PETROMISIONES S.A.",
    "Telefono":"",
    "OSM":1946136012
    }
  },
  {
    "type": "Feature",
    "geometry": {
       "type": "Point",
       "coordinates":  [ -55.9123803,-27.390345 ]
    },
    "properties": {
    "Nombre":"Shell",
    "Localidad":"Posadas",
    "Calle":"Avenida Santa Catalina",
    "Numero":4672,
    "CodigoPostal":3300,
    "Marca":"Shell",
    "Operador":"PETROMISIONES S.A.",
    "Telefono":"",
    "OSM":1946137020
    }
  },
  {
    "type": "Feature",
    "geometry": {
       "type": "Point",
       "coordinates":  [ -55.9127208,-27.3928711 ]
    },
    "properties": {
    "Nombre":"Oil",
    "Localidad":"",
    "Calle":"",
    "Numero":"",
    "CodigoPostal":"",
    "Marca":"Oil",
    "Operador":"SANTA CATALINA S.R.L.",
    "Telefono":"",
    "OSM":1946138277
    }
  },
  {
    "type": "Feature",
    "geometry": {
       "type": "Point",
       "coordinates":  [ -55.8765077,-27.4425046 ]
    },
    "properties": {
    "Nombre":"YPF La Nueva Fátima",
    "Localidad":"",
    "Calle":"",
    "Numero":"",
    "CodigoPostal":"",
    "Marca":"YPF",
    "Operador":"OPESSA POSADAS FATIMA",
    "Telefono":"",
    "OSM":1946145548
    }
  },
  {
    "type": "Feature",
    "geometry": {
       "type": "Point",
       "coordinates":  [ -55.028748,-26.822904 ]
    },
    "properties": {
    "Nombre":"Shell",
    "Localidad":"Puerto Rico",
    "Calle":"Jose Maria Paso",
    "Numero":"",
    "CodigoPostal":3334,
    "Marca":"Shell",
    "Operador":"PETA S.R.L.",
    "Telefono":"",
    "OSM":1980159722
    }
  },
  {
    "type": "Feature",
    "geometry": {
       "type": "Point",
       "coordinates":  [ -55.027172,-26.8184076 ]
    },
    "properties": {
    "Nombre":"YPF",
    "Localidad":"Puerto Rico",
    "Calle":"Avenida San Martín",
    "Numero":"",
    "CodigoPostal":3334,
    "Marca":"YPF",
    "Operador":"ARNO SEEWALD SA",
    "Telefono":"",
    "OSM":1980159731
    }
  },
  {
    "type": "Feature",
    "geometry": {
       "type": "Point",
       "coordinates":  [ -54.2036277,-27.293902 ]
    },
    "properties": {
    "Nombre":"YPF",
    "Localidad":"",
    "Calle":"",
    "Numero":"",
    "CodigoPostal":"",
    "Marca":"YPF",
    "Operador":"PETROVALLE SA",
    "Telefono":"",
    "OSM":2012534157
    }
  },
  {
    "type": "Feature",
    "geometry": {
       "type": "Point",
       "coordinates":  [ -54.5363821,-27.4517973 ]
    },
    "properties": {
    "Nombre":"CAUL",
    "Localidad":"",
    "Calle":"",
    "Numero":"",
    "CodigoPostal":"",
    "Marca":"Bandera Blanca",
    "Operador":"",
    "Telefono":"",
    "OSM":2012612867
    }
  },
  {
    "type": "Feature",
    "geometry": {
       "type": "Point",
       "coordinates":  [ -55.8402082,-27.46158 ]
    },
    "properties": {
    "Nombre":"Gasolinera Garupá",
    "Localidad":"Garupá",
    "Calle":"Ruta Nacional 12",
    "Numero":"",
    "CodigoPostal":3304,
    "Marca":"Bandera Blanca",
    "Operador":"",
    "Telefono":"",
    "OSM":2084344583
    }
  },
  {
    "type": "Feature",
    "geometry": {
       "type": "Point",
       "coordinates":  [ -55.9019995,-27.4089867 ]
    },
    "properties": {
    "Nombre":"YPF Santa María",
    "Localidad":"",
    "Calle":"",
    "Numero":"",
    "CodigoPostal":"",
    "Marca":"YPF",
    "Operador":"INVERSORA SA",
    "Telefono":"",
    "OSM":2084469494
    }
  },
  {
    "type": "Feature",
    "geometry": {
       "type": "Point",
       "coordinates":  [ -55.5232742,-27.9762106 ]
    },
    "properties": {
    "Nombre":"La Rotonda",
    "Localidad":"Concepción de la Sierra",
    "Calle":"Ruta Provincial 2",
    "Numero":"",
    "CodigoPostal":"",
    "Marca":"Bandera Blanca",
    "Operador":"Pernigotti",
    "Telefono":"",
    "OSM":2085443501
    }
  },
  {
    "type": "Feature",
    "geometry": {
       "type": "Point",
       "coordinates":  [ -54.585114,-26.018816 ]
    },
    "properties": {
    "Nombre":"Shell",
    "Localidad":"",
    "Calle":"",
    "Numero":"",
    "CodigoPostal":"",
    "Marca":"Shell",
    "Operador":"EJE S.A.",
    "Telefono":"",
    "OSM":2110697106
    }
  },
  {
    "type": "Feature",
    "geometry": {
       "type": "Point",
       "coordinates":  [ -54.5868407,-26.0276964 ]
    },
    "properties": {
    "Nombre":"YPF",
    "Localidad":"",
    "Calle":"",
    "Numero":"",
    "CodigoPostal":"",
    "Marca":"YPF",
    "Operador":"PETROIGUAZU SA",
    "Telefono":"",
    "OSM":2110697115
    }
  },
  {
    "type": "Feature",
    "geometry": {
       "type": "Point",
       "coordinates":  [ -54.5721516,-25.6018209 ]
    },
    "properties": {
    "Nombre":"YPF",
    "Localidad":"",
    "Calle":"Avenida Victoria Aguirre",
    "Numero":29,
    "CodigoPostal":"",
    "Marca":"YPF",
    "Operador":"PETRO IGUAZU SA",
    "Telefono":"",
    "OSM":2135413010
    }
  },
  {
    "type": "Feature",
    "geometry": {
       "type": "Point",
       "coordinates":  [ -55.89732,-27.39117 ]
    },
    "properties": {
    "Nombre":"Axion",
    "Localidad":"Posadas",
    "Calle":"Avenida Monteagudo",
    "Numero":1824,
    "CodigoPostal":3300,
    "Marca":"Axion",
    "Operador":"OPERADORA COMERCIAL S.A",
    "Telefono":"",
    "OSM":2357219251
    }
  },
  {
    "type": "Feature",
    "geometry": {
       "type": "Point",
       "coordinates":  [ -54.6453886,-26.4247013 ]
    },
    "properties": {
    "Nombre":"YPF",
    "Localidad":"",
    "Calle":"",
    "Numero":"",
    "CodigoPostal":"",
    "Marca":"YPF",
    "Operador":"ERIKSEN Y CIA SA",
    "Telefono":"",
    "OSM":2628314818
    }
  },
  {
    "type": "Feature",
    "geometry": {
       "type": "Point",
       "coordinates":  [ -54.1128933,-26.6158095 ]
    },
    "properties": {
    "Nombre":"Axion",
    "Localidad":"",
    "Calle":"",
    "Numero":"",
    "CodigoPostal":"",
    "Marca":"Axion",
    "Operador":"SCHOLLES OMAR ALBERTO",
    "Telefono":"",
    "OSM":2628314822
    }
  },
  {
    "type": "Feature",
    "geometry": {
       "type": "Point",
       "coordinates":  [ -55.9246022,-27.3681983 ]
    },
    "properties": {
    "Nombre":"Axion",
    "Localidad":"Posadas",
    "Calle":"Avenida Tambor de Tacuarí",
    "Numero":4910,
    "CodigoPostal":"",
    "Marca":"Axion",
    "Operador":"DEL NORDESTE S.A.",
    "Telefono":"",
    "OSM":2628314826
    }
  },
  {
    "type": "Feature",
    "geometry": {
       "type": "Point",
       "coordinates":  [ -54.7273145,-27.5247465 ]
    },
    "properties": {
    "Nombre":"Estación de Servicio Mercosur",
    "Localidad":"",
    "Calle":"",
    "Numero":"",
    "CodigoPostal":"",
    "Marca":"Bandera Blanca",
    "Operador":"ZAMBERLAN ARGENTINO",
    "Telefono":"",
    "OSM":2628382062
    }
  },
  {
    "type": "Feature",
    "geometry": {
       "type": "Point",
       "coordinates":  [ -54.20612,-27.29076 ]
    },
    "properties": {
    "Nombre":"",
    "Localidad":"",
    "Calle":"",
    "Numero":"",
    "CodigoPostal":"",
    "Marca":"Bandera Blanca",
    "Operador":"ESTACIONES HILDEBRANDT S.R.L.",
    "Telefono":"",
    "OSM":2628472346
    }
  },
  {
    "type": "Feature",
    "geometry": {
       "type": "Point",
       "coordinates":  [ -54.7444851,-27.3784321 ]
    },
    "properties": {
    "Nombre":"",
    "Localidad":"",
    "Calle":"",
    "Numero":"",
    "CodigoPostal":"",
    "Marca":"Bandera Blanca",
    "Operador":"COOP ALTO URUGUAY DE ELEC Y O S P A F Y C LTDA",
    "Telefono":"",
    "OSM":2628475774
    }
  },
  {
    "type": "Feature",
    "geometry": {
       "type": "Point",
       "coordinates":  [ -54.7480683,-27.3895839 ]
    },
    "properties": {
    "Nombre":"",
    "Localidad":"",
    "Calle":"",
    "Numero":"",
    "CodigoPostal":"",
    "Marca":"Bandera Blanca",
    "Operador":"COOP ALTO URUGUAY DE ELEC Y O S P A F Y C LTDA",
    "Telefono":"",
    "OSM":2628475775
    }
  },
  {
    "type": "Feature",
    "geometry": {
       "type": "Point",
       "coordinates":  [ -54.8409264,-27.0846884 ]
    },
    "properties": {
    "Nombre":"",
    "Localidad":"",
    "Calle":"",
    "Numero":"",
    "CodigoPostal":"",
    "Marca":"Bandera Blanca",
    "Operador":"ESTACIONES HILDEBRANDT S.R.L.",
    "Telefono":"",
    "OSM":2628476922
    }
  },
  {
    "type": "Feature",
    "geometry": {
       "type": "Point",
       "coordinates":  [ -54.7279908,-27.5237641 ]
    },
    "properties": {
    "Nombre":"",
    "Localidad":"",
    "Calle":"",
    "Numero":"",
    "CodigoPostal":"",
    "Marca":"Bandera Blanca",
    "Operador":"Petrovalle S.A.",
    "Telefono":"",
    "OSM":2628507303
    }
  },
  {
    "type": "Feature",
    "geometry": {
       "type": "Point",
       "coordinates":  [ -54.9617091,-27.483884 ]
    },
    "properties": {
    "Nombre":"",
    "Localidad":"",
    "Calle":"",
    "Numero":"",
    "CodigoPostal":"",
    "Marca":"Bandera Blanca",
    "Operador":"MIKOLOW BASILIO ERNESTO",
    "Telefono":"",
    "OSM":2628528908
    }
  },
  {
    "type": "Feature",
    "geometry": {
       "type": "Point",
       "coordinates":  [ -54.2977677,-26.7433694 ]
    },
    "properties": {
    "Nombre":"",
    "Localidad":"",
    "Calle":"",
    "Numero":"",
    "CodigoPostal":"",
    "Marca":"Bandera Blanca",
    "Operador":"Petrovalle S.A.",
    "Telefono":"",
    "OSM":2628558068
    }
  },
  {
    "type": "Feature",
    "geometry": {
       "type": "Point",
       "coordinates":  [ -54.6751464,-27.0371256 ]
    },
    "properties": {
    "Nombre":"",
    "Localidad":"",
    "Calle":"",
    "Numero":"",
    "CodigoPostal":"",
    "Marca":"Bandera Blanca",
    "Operador":"WEBER RICARDO ENRIQUE",
    "Telefono":"",
    "OSM":2628558229
    }
  },
  {
    "type": "Feature",
    "geometry": {
       "type": "Point",
       "coordinates":  [ -54.1520023,-26.3465444 ]
    },
    "properties": {
    "Nombre":"",
    "Localidad":"",
    "Calle":"",
    "Numero":"",
    "CodigoPostal":"",
    "Marca":"Bandera Blanca",
    "Operador":"SIEVES VALDIR",
    "Telefono":"",
    "OSM":2628563099
    }
  },
  {
    "type": "Feature",
    "geometry": {
       "type": "Point",
       "coordinates":  [ -53.6487865,-26.2608906 ]
    },
    "properties": {
    "Nombre":"",
    "Localidad":"",
    "Calle":"",
    "Numero":"",
    "CodigoPostal":"",
    "Marca":"Bandera Blanca",
    "Operador":"ESTACION DE SERVICIO EL TIGRE S.H. DE FELDMAN",
    "Telefono":"",
    "OSM":2628742552
    }
  },
  {
    "type": "Feature",
    "geometry": {
       "type": "Point",
       "coordinates":  [ -53.6507409,-26.2625244 ]
    },
    "properties": {
    "Nombre":"",
    "Localidad":"",
    "Calle":"",
    "Numero":"",
    "CodigoPostal":"",
    "Marca":"Bandera Blanca",
    "Operador":"JUNES MAURO ROBERTO",
    "Telefono":"",
    "OSM":2628742584
    }
  },
  {
    "type": "Feature",
    "geometry": {
       "type": "Point",
       "coordinates":  [ -55.9125795,-27.3953352 ]
    },
    "properties": {
    "Nombre":"YPF",
    "Localidad":"Posadas",
    "Calle":"Avenida Santa Catalina",
    "Numero":"",
    "CodigoPostal":3300,
    "Marca":"YPF",
    "Operador":"ADOLFO SARTORI SA",
    "Telefono":"",
    "OSM":2661968536
    }
  },
  {
    "type": "Feature",
    "geometry": {
       "type": "Point",
       "coordinates":  [ -54.902959,-27.1125706 ]
    },
    "properties": {
    "Nombre":"YPF",
    "Localidad":"",
    "Calle":"",
    "Numero":"",
    "CodigoPostal":"",
    "Marca":"YPF",
    "Operador":"PETROVALLE SA",
    "Telefono":"",
    "OSM":2663433306
    }
  },
  {
    "type": "Feature",
    "geometry": {
       "type": "Point",
       "coordinates":  [ -55.9188174,-27.3853665 ]
    },
    "properties": {
    "Nombre":"YPF",
    "Localidad":"",
    "Calle":"",
    "Numero":"",
    "CodigoPostal":"",
    "Marca":"YPF",
    "Operador":"VERINO SRL",
    "Telefono":"",
    "OSM":2706833177
    }
  },
  {
    "type": "Feature",
    "geometry": {
       "type": "Point",
       "coordinates":  [ -55.3199346,-27.6166682 ]
    },
    "properties": {
    "Nombre":"Oil",
    "Localidad":"",
    "Calle":"",
    "Numero":"",
    "CodigoPostal":"",
    "Marca":"Oil",
    "Operador":"LA ROTONDA S.R.L.",
    "Telefono":"",
    "OSM":2733394916
    }
  },
  {
    "type": "Feature",
    "geometry": {
       "type": "Point",
       "coordinates":  [ -55.7820972,-27.7455122 ]
    },
    "properties": {
    "Nombre":"",
    "Localidad":"",
    "Calle":"",
    "Numero":"",
    "CodigoPostal":"",
    "Marca":"Axion",
    "Operador":"DOS MIL S.A.",
    "Telefono":"",
    "OSM":2733987404
    }
  },
  {
    "type": "Feature",
    "geometry": {
       "type": "Point",
       "coordinates":  [ -53.6483184,-26.2614162 ]
    },
    "properties": {
    "Nombre":"YPF ACA",
    "Localidad":"",
    "Calle":"",
    "Numero":"",
    "CodigoPostal":"",
    "Marca":"YPF",
    "Operador":"ACA BERNARDO DE IRIGOYEN",
    "Telefono":"",
    "OSM":2851401550
    }
  },
  {
    "type": "Feature",
    "geometry": {
       "type": "Point",
       "coordinates":  [ -55.0537554,-27.3419895 ]
    },
    "properties": {
    "Nombre":"YPF",
    "Localidad":"",
    "Calle":"",
    "Numero":"",
    "CodigoPostal":"",
    "Marca":"YPF",
    "Operador":"PETROVALLE SA",
    "Telefono":"",
    "OSM":2866287202
    }
  },
  {
    "type": "Feature",
    "geometry": {
       "type": "Point",
       "coordinates":  [ -55.9351657,-27.3671135 ]
    },
    "properties": {
    "Nombre":"YPF",
    "Localidad":"",
    "Calle":"Avenida Tambor de Tacuarí",
    "Numero":"",
    "CodigoPostal":"",
    "Marca":"YPF",
    "Operador":"VERINO SRL",
    "Telefono":"",
    "OSM":3110059154
    }
  },
  {
    "type": "Feature",
    "geometry": {
       "type": "Point",
       "coordinates":  [ -55.92564,-27.371472 ]
    },
    "properties": {
    "Nombre":"Shell",
    "Localidad":"Posadas",
    "Calle":"Avenida López y Planes",
    "Numero":"",
    "CodigoPostal":"",
    "Marca":"Shell",
    "Operador":"GRONDAL S.A.",
    "Telefono":"",
    "OSM":3359336289
    }
  },
  {
    "type": "Feature",
    "geometry": {
       "type": "Point",
       "coordinates":  [ -53.6463532,-26.2538199 ]
    },
    "properties": {
    "Nombre":"El Tigre",
    "Localidad":"",
    "Calle":"",
    "Numero":"",
    "CodigoPostal":"",
    "Marca":"Bandera Blanca",
    "Operador":"ESTACION DE SERVICIO EL TIGRE S.H. DE FELDMAN",
    "Telefono":"",
    "OSM":3486739501
    }
  },
  {
    "type": "Feature",
    "geometry": {
       "type": "Point",
       "coordinates":  [ -55.75201,-27.91318 ]
    },
    "properties": {
    "Nombre":"RAM",
    "Localidad":"",
    "Calle":"",
    "Numero":"",
    "CodigoPostal":"",
    "Marca":"Bandera Blanca",
    "Operador":"MEROIL S.A.",
    "Telefono":"",
    "OSM":3695487733
    }
  },
  {
    "type": "Feature",
    "geometry": {
       "type": "Point",
       "coordinates":  [ -54.5963332,-26.4084501 ]
    },
    "properties": {
    "Nombre":"Oil",
    "Localidad":"",
    "Calle":"",
    "Numero":"",
    "CodigoPostal":"",
    "Marca":"Oil",
    "Operador":"GRONDAL S.A.",
    "Telefono":"",
    "OSM":3802854157
    }
  },
  {
    "type": "Feature",
    "geometry": {
       "type": "Point",
       "coordinates":  [ -54.5625155,-25.9720481 ]
    },
    "properties": {
    "Nombre":"Shell",
    "Localidad":"",
    "Calle":"",
    "Numero":"",
    "CodigoPostal":"",
    "Marca":"Shell",
    "Operador":"EJE S.A.",
    "Telefono":"",
    "OSM":3917011051
    }
  },
  {
    "type": "Feature",
    "geometry": {
       "type": "Point",
       "coordinates":  [ -54.6135404,-26.0134931 ]
    },
    "properties": {
    "Nombre":"YPF",
    "Localidad":"",
    "Calle":"",
    "Numero":"",
    "CodigoPostal":"",
    "Marca":"YPF",
    "Operador":"PETROIGUAZU SA",
    "Telefono":"",
    "OSM":3917011052
    }
  },
  {
    "type": "Feature",
    "geometry": {
       "type": "Point",
       "coordinates":  [ -53.64533,-26.25204 ]
    },
    "properties": {
    "Nombre":"",
    "Localidad":"",
    "Calle":"",
    "Numero":"",
    "CodigoPostal":"",
    "Marca":"Bandera Blanca",
    "Operador":"Weber Ricardo Enrique",
    "Telefono":"",
    "OSM":3917011053
    }
  },
  {
    "type": "Feature",
    "geometry": {
       "type": "Point",
       "coordinates":  [ -54.631984,-26.4037588 ]
    },
    "properties": {
    "Nombre":"Shell",
    "Localidad":"",
    "Calle":"",
    "Numero":"",
    "CodigoPostal":"",
    "Marca":"Shell",
    "Operador":"BEIRUT S.R.L.",
    "Telefono":"",
    "OSM":3917011054
    }
  },
  {
    "type": "Feature",
    "geometry": {
       "type": "Point",
       "coordinates":  [ -54.6201833,-26.4048025 ]
    },
    "properties": {
    "Nombre":"YPF",
    "Localidad":"",
    "Calle":"",
    "Numero":"",
    "CodigoPostal":"",
    "Marca":"YPF",
    "Operador":"IGNACIO MESCHEDE Y CIA SRL",
    "Telefono":"",
    "OSM":3917011055
    }
  },
  {
    "type": "Feature",
    "geometry": {
       "type": "Point",
       "coordinates":  [ -54.742357,-26.57177 ]
    },
    "properties": {
    "Nombre":"Shell",
    "Localidad":"",
    "Calle":"",
    "Numero":"",
    "CodigoPostal":"",
    "Marca":"Shell",
    "Operador":"GRONDAL S.A.",
    "Telefono":"",
    "OSM":3917011056
    }
  },
  {
    "type": "Feature",
    "geometry": {
       "type": "Point",
       "coordinates":  [ -54.4831993,-26.9963158 ]
    },
    "properties": {
    "Nombre":"YPF",
    "Localidad":"",
    "Calle":"",
    "Numero":"",
    "CodigoPostal":"",
    "Marca":"YPF",
    "Operador":"PETROVALLE SA",
    "Telefono":"",
    "OSM":3917021357
    }
  },
  {
    "type": "Feature",
    "geometry": {
       "type": "Point",
       "coordinates":  [ -54.6871958,-27.0254152 ]
    },
    "properties": {
    "Nombre":"YPF",
    "Localidad":"Dos de Mayo",
    "Calle":"Avenida del Colono",
    "Numero":"",
    "CodigoPostal":3364,
    "Marca":"YPF",
    "Operador":"PETROVALLE SA",
    "Telefono":"",
    "OSM":3917021358
    }
  },
  {
    "type": "Feature",
    "geometry": {
       "type": "Point",
       "coordinates":  [ -55.40762,-27.14474 ]
    },
    "properties": {
    "Nombre":"",
    "Localidad":"",
    "Calle":"",
    "Numero":"",
    "CodigoPostal":"",
    "Marca":"Bandera Blanca",
    "Operador":"SPACIUK MARCELO ANDRES",
    "Telefono":"",
    "OSM":3917021359
    }
  },
  {
    "type": "Feature",
    "geometry": {
       "type": "Point",
       "coordinates":  [ -55.1118261,-27.5017651 ]
    },
    "properties": {
    "Nombre":"Axion",
    "Localidad":"Oberá",
    "Calle":"",
    "Numero":"",
    "CodigoPostal":"",
    "Marca":"Axion",
    "Operador":"SERVICENTROS OBERA S.A.",
    "Telefono":"",
    "OSM":3917021360
    }
  },
  {
    "type": "Feature",
    "geometry": {
       "type": "Point",
       "coordinates":  [ -55.3141447,-27.615066 ]
    },
    "properties": {
    "Nombre":"YPF",
    "Localidad":"",
    "Calle":"",
    "Numero":"",
    "CodigoPostal":"",
    "Marca":"YPF",
    "Operador":"ADOLFO SARTORI SA",
    "Telefono":"",
    "OSM":3917021361
    }
  },
  {
    "type": "Feature",
    "geometry": {
       "type": "Point",
       "coordinates":  [ -55.12423,-27.48613 ]
    },
    "properties": {
    "Nombre":"YPF",
    "Localidad":"Oberá",
    "Calle":"Avenida Sarmiento",
    "Numero":1128,
    "CodigoPostal":3360,
    "Marca":"YPF",
    "Operador":"PETROVALLE SA",
    "Telefono":"",
    "OSM":3917139531
    }
  },
  {
    "type": "Feature",
    "geometry": {
       "type": "Point",
       "coordinates":  [ -55.9218178,-27.4020991 ]
    },
    "properties": {
    "Nombre":"Axion",
    "Localidad":"Posadas",
    "Calle":"Avenida Quaranta",
    "Numero":4150,
    "CodigoPostal":3300,
    "Marca":"Axion",
    "Operador":"PUERTA S.A.",
    "Telefono":"",
    "OSM":3917139532
    }
  },
  {
    "type": "Feature",
    "geometry": {
       "type": "Point",
       "coordinates":  [ -54.6047781,-26.4081233 ]
    },
    "properties": {
    "Nombre":"YPF ACA",
    "Localidad":"",
    "Calle":"",
    "Numero":"",
    "CodigoPostal":"",
    "Marca":"YPF",
    "Operador":"ACA ELDORADO",
    "Telefono":"",
    "OSM":3917139533
    }
  },
  {
    "type": "Feature",
    "geometry": {
       "type": "Point",
       "coordinates":  [ -54.60369,-26.40861 ]
    },
    "properties": {
    "Nombre":"YPF",
    "Localidad":"",
    "Calle":"",
    "Numero":"",
    "CodigoPostal":"",
    "Marca":"YPF",
    "Operador":"ERIKSEN Y CIA SA",
    "Telefono":"",
    "OSM":3917139534
    }
  },
  {
    "type": "Feature",
    "geometry": {
       "type": "Point",
       "coordinates":  [ -55.0596454,-26.9250095 ]
    },
    "properties": {
    "Nombre":"Shell",
    "Localidad":"",
    "Calle":"",
    "Numero":"",
    "CodigoPostal":"",
    "Marca":"Shell",
    "Operador":"ELY JOSE JORGE",
    "Telefono":"",
    "OSM":3917139539
    }
  },
  {
    "type": "Feature",
    "geometry": {
       "type": "Point",
       "coordinates":  [ -55.2146298,-27.0294033 ]
    },
    "properties": {
    "Nombre":"YPF",
    "Localidad":"",
    "Calle":"",
    "Numero":"",
    "CodigoPostal":"",
    "Marca":"YPF",
    "Operador":"PETROVALLE SA",
    "Telefono":"",
    "OSM":3917139544
    }
  },
  {
    "type": "Feature",
    "geometry": {
       "type": "Point",
       "coordinates":  [ -55.22739,-27.03734 ]
    },
    "properties": {
    "Nombre":"Axion",
    "Localidad":"",
    "Calle":"",
    "Numero":"",
    "CodigoPostal":"",
    "Marca":"Axion",
    "Operador":"LOS CERRITOS S.A.",
    "Telefono":"",
    "OSM":3917139545
    }
  },
  {
    "type": "Feature",
    "geometry": {
       "type": "Point",
       "coordinates":  [ -55.23486,-27.04266 ]
    },
    "properties": {
    "Nombre":"Shell",
    "Localidad":"",
    "Calle":"",
    "Numero":"",
    "CodigoPostal":"",
    "Marca":"Shell",
    "Operador":"PETROMISIONES S.A. - 685",
    "Telefono":"",
    "OSM":3917139546
    }
  },
  {
    "type": "Feature",
    "geometry": {
       "type": "Point",
       "coordinates":  [ -55.4569164,-27.1784257 ]
    },
    "properties": {
    "Nombre":"",
    "Localidad":"",
    "Calle":"",
    "Numero":"",
    "CodigoPostal":"",
    "Marca":"Bandera Blanca",
    "Operador":"GRONDAL S A",
    "Telefono":"",
    "OSM":3917139547
    }
  },
  {
    "type": "Feature",
    "geometry": {
       "type": "Point",
       "coordinates":  [ -55.89618,-27.3685 ]
    },
    "properties": {
    "Nombre":"Axion",
    "Localidad":"",
    "Calle":"",
    "Numero":"",
    "CodigoPostal":"",
    "Marca":"Axion",
    "Operador":"OPERADORA COMERCIAL S.A",
    "Telefono":"",
    "OSM":3917139548
    }
  },
  {
    "type": "Feature",
    "geometry": {
       "type": "Point",
       "coordinates":  [ -55.9000679,-27.3840211 ]
    },
    "properties": {
    "Nombre":"Axion",
    "Localidad":"Posadas",
    "Calle":"Avenida Uruguay",
    "Numero":"",
    "CodigoPostal":3300,
    "Marca":"Axion",
    "Operador":"PUERTA S.A.",
    "Telefono":"",
    "OSM":3917139550
    }
  },
  {
    "type": "Feature",
    "geometry": {
       "type": "Point",
       "coordinates":  [ -55.90966,-27.39704 ]
    },
    "properties": {
    "Nombre":"YPF",
    "Localidad":"",
    "Calle":"",
    "Numero":"",
    "CodigoPostal":"",
    "Marca":"YPF",
    "Operador":"PETROVALLE SA",
    "Telefono":"",
    "OSM":3917139551
    }
  },
  {
    "type": "Feature",
    "geometry": {
       "type": "Point",
       "coordinates":  [ -55.0907466,-27.4846336 ]
    },
    "properties": {
    "Nombre":"YPF",
    "Localidad":"",
    "Calle":"",
    "Numero":"",
    "CodigoPostal":"",
    "Marca":"YPF",
    "Operador":"PETROVALLE SA",
    "Telefono":"",
    "OSM":3917139552
    }
  },
  {
    "type": "Feature",
    "geometry": {
       "type": "Point",
       "coordinates":  [ -55.1260498,-27.4868986 ]
    },
    "properties": {
    "Nombre":"ACA",
    "Localidad":"",
    "Calle":"",
    "Numero":"",
    "CodigoPostal":"",
    "Marca":"YPF",
    "Operador":"ACA OBERA",
    "Telefono":"",
    "OSM":3917139553
    }
  },
  {
    "type": "Feature",
    "geometry": {
       "type": "Point",
       "coordinates":  [ -55.101832,-27.491237 ]
    },
    "properties": {
    "Nombre":"Shell",
    "Localidad":"Oberá",
    "Calle":"Avenida Beltrame",
    "Numero":"",
    "CodigoPostal":"",
    "Marca":"Shell",
    "Operador":"SAND Y ALBRECHTSEN S.A.C.I.F.E.I.",
    "Telefono":"",
    "OSM":3917139554
    }
  },
  {
    "type": "Feature",
    "geometry": {
       "type": "Point",
       "coordinates":  [ -55.0575954,-26.9689184 ]
    },
    "properties": {
    "Nombre":"",
    "Localidad":"",
    "Calle":"",
    "Numero":"",
    "CodigoPostal":"",
    "Marca":"Bandera Blanca",
    "Operador":"",
    "Telefono":"",
    "OSM":4059085481
    }
  },
  {
    "type": "Feature",
    "geometry": {
       "type": "Point",
       "coordinates":  [ -53.7558567,-26.2943077 ]
    },
    "properties": {
    "Nombre":"",
    "Localidad":"Dos Hermanas",
    "Calle":"Ruta Provincial 17",
    "Numero":"",
    "CodigoPostal":"",
    "Marca":"Bandera Blanca",
    "Operador":"",
    "Telefono":"",
    "OSM":4096995186
    }
  },
  {
    "type": "Feature",
    "geometry": {
       "type": "Point",
       "coordinates":  [ -55.9309213,-27.4190015 ]
    },
    "properties": {
    "Nombre":"YPF",
    "Localidad":"",
    "Calle":"Colectora Alicia Moreau de Justo",
    "Numero":"",
    "CodigoPostal":"",
    "Marca":"YPF",
    "Operador":"",
    "Telefono":"",
    "OSM":4198518361
    }
  },
  {
    "type": "Feature",
    "geometry": {
       "type": "Point",
       "coordinates":  [ -54.5341648,-27.4504188 ]
    },
    "properties": {
    "Nombre":"",
    "Localidad":"",
    "Calle":"",
    "Numero":"",
    "CodigoPostal":"",
    "Marca":"Bandera Blanca",
    "Operador":"",
    "Telefono":"",
    "OSM":4285050684
    }
  },
  {
    "type": "Feature",
    "geometry": {
       "type": "Point",
       "coordinates":  [ -54.7264169,-26.5823382 ]
    },
    "properties": {
    "Nombre":"Petrovalle",
    "Localidad":"",
    "Calle":"",
    "Numero":"",
    "CodigoPostal":"",
    "Marca":"YPF",
    "Operador":"",
    "Telefono":"",
    "OSM":4298628980
    }
  },
  {
    "type": "Feature",
    "geometry": {
       "type": "Point",
       "coordinates":  [ -55.5016723,-27.6429247 ]
    },
    "properties": {
    "Nombre":"",
    "Localidad":"",
    "Calle":"",
    "Numero":"",
    "CodigoPostal":"",
    "Marca":"Bandera Blanca",
    "Operador":"",
    "Telefono":"",
    "OSM":4326162848
    }
  },
  {
    "type": "Feature",
    "geometry": {
       "type": "Point",
       "coordinates":  [ -55.856992,-27.4566785 ]
    },
    "properties": {
    "Nombre":"GLPA Misiones",
    "Localidad":"Garupá",
    "Calle":"Ruta Nacional 12",
    "Numero":"",
    "CodigoPostal":3304,
    "Marca":"Bandera Blanca",
    "Operador":"Salustri S.A.",
    "Telefono":"",
    "OSM":4451141446
    }
  },
  {
    "type": "Feature",
    "geometry": {
       "type": "Point",
       "coordinates":  [ -54.7106349,-26.4770602 ]
    },
    "properties": {
    "Nombre":"",
    "Localidad":"",
    "Calle":"",
    "Numero":"",
    "CodigoPostal":"",
    "Marca":"Bandera Blanca",
    "Operador":"",
    "Telefono":"",
    "OSM":4465607498
    }
  },
  {
    "type": "Feature",
    "geometry": {
       "type": "Point",
       "coordinates":  [ -55.4941299,-27.6342837 ]
    },
    "properties": {
    "Nombre":"Castrol",
    "Localidad":"Cerro Azul",
    "Calle":"Sargento Cabral",
    "Numero":508,
    "CodigoPostal":3313,
    "Marca":"Castrol",
    "Operador":"",
    "Telefono":"+54 376 4494228",
    "OSM":4489386661
    }
  },
  {
    "type": "Feature",
    "geometry": {
       "type": "Point",
       "coordinates":  [ -54.8952474,-27.1060955 ]
    },
    "properties": {
    "Nombre":"YPF",
    "Localidad":"",
    "Calle":"",
    "Numero":"",
    "CodigoPostal":"",
    "Marca":"YPF",
    "Operador":"Petrovalle",
    "Telefono":"",
    "OSM":4504434545
    }
  },
  {
    "type": "Feature",
    "geometry": {
       "type": "Point",
       "coordinates":  [ -54.195138,-27.2762561 ]
    },
    "properties": {
    "Nombre":"",
    "Localidad":"",
    "Calle":"",
    "Numero":"",
    "CodigoPostal":"",
    "Marca":"Bandera Blanca",
    "Operador":"",
    "Telefono":"",
    "OSM":4550109956
    }
  },
  {
    "type": "Feature",
    "geometry": {
       "type": "Point",
       "coordinates":  [ -54.468912,-27.0107962 ]
    },
    "properties": {
    "Nombre":"Axion",
    "Localidad":"",
    "Calle":"",
    "Numero":"",
    "CodigoPostal":"",
    "Marca":"Axion",
    "Operador":"AXXION",
    "Telefono":"",
    "OSM":4550128755
    }
  },
  {
    "type": "Feature",
    "geometry": {
       "type": "Point",
       "coordinates":  [ -54.8183448,-26.7059803 ]
    },
    "properties": {
    "Nombre":"",
    "Localidad":"",
    "Calle":"",
    "Numero":"",
    "CodigoPostal":"",
    "Marca":"Bandera Blanca",
    "Operador":"",
    "Telefono":"",
    "OSM":4566098292
    }
  },
  {
    "type": "Feature",
    "geometry": {
       "type": "Point",
       "coordinates":  [ -54.6664454,-26.4072128 ]
    },
    "properties": {
    "Nombre":"Combustibles Yut Sui",
    "Localidad":"",
    "Calle":"",
    "Numero":"",
    "CodigoPostal":"",
    "Marca":"Bandera Blanca",
    "Operador":"",
    "Telefono":"",
    "OSM":4575898394
    }
  },
  {
    "type": "Feature",
    "geometry": {
       "type": "Point",
       "coordinates":  [ -54.8163951,-26.7101636 ]
    },
    "properties": {
    "Nombre":"",
    "Localidad":"",
    "Calle":"",
    "Numero":"",
    "CodigoPostal":"",
    "Marca":"Bandera Blanca",
    "Operador":"",
    "Telefono":"",
    "OSM":4678778053
    }
  },
  {
    "type": "Feature",
    "geometry": {
       "type": "Point",
       "coordinates":  [ -55.9513111,-27.3995197 ]
    },
    "properties": {
    "Nombre":"Axion",
    "Localidad":"Posadas",
    "Calle":"Avenida Isaco Abitbol",
    "Numero":"",
    "CodigoPostal":"",
    "Marca":"Axion",
    "Operador":"Verino SRL",
    "Telefono":"",
    "OSM":4692338657
    }
  },
  {
    "type": "Feature",
    "geometry": {
       "type": "Point",
       "coordinates":  [ -54.0434099,-25.6704653 ]
    },
    "properties": {
    "Nombre":"Lebanon SRL",
    "Localidad":"Comandante Andresito",
    "Calle":"Avenida Los Pioneros",
    "Numero":"",
    "CodigoPostal":"",
    "Marca":"YPF",
    "Operador":"",
    "Telefono":"",
    "OSM":4731325325
    }
  },
  {
    "type": "Feature",
    "geometry": {
       "type": "Point",
       "coordinates":  [ -54.5244412,-27.4738989 ]
    },
    "properties": {
    "Nombre":"Estación de Servicio Aurora",
    "Localidad":"",
    "Calle":"Avenida Santa Catalina",
    "Numero":"",
    "CodigoPostal":"",
    "Marca":"Bandera Blanca",
    "Operador":"",
    "Telefono":"",
    "OSM":4952478658
    }
  },
  {
    "type": "Feature",
    "geometry": {
       "type": "Point",
       "coordinates":  [ -53.9195019,-25.9266931 ]
    },
    "properties": {
    "Nombre":"",
    "Localidad":"",
    "Calle":"",
    "Numero":"",
    "CodigoPostal":"",
    "Marca":"Bandera Blanca",
    "Operador":"",
    "Telefono":"",
    "OSM":5010376136
    }
  },
  {
    "type": "Feature",
    "geometry": {
       "type": "Point",
       "coordinates":  [ -53.7326883,-26.0556378 ]
    },
    "properties": {
    "Nombre":"JB",
    "Localidad":"",
    "Calle":"",
    "Numero":"",
    "CodigoPostal":"",
    "Marca":"Bandera Blanca",
    "Operador":"",
    "Telefono":"",
    "OSM":5010449473
    }
  },
  {
    "type": "Feature",
    "geometry": {
       "type": "Point",
       "coordinates":  [ -53.7326124,-26.0551361 ]
    },
    "properties": {
    "Nombre":"",
    "Localidad":"",
    "Calle":"",
    "Numero":"",
    "CodigoPostal":"",
    "Marca":"Bandera Blanca",
    "Operador":"",
    "Telefono":"",
    "OSM":5010449510
    }
  },
  {
    "type": "Feature",
    "geometry": {
       "type": "Point",
       "coordinates":  [ -54.351712,-27.3784032 ]
    },
    "properties": {
    "Nombre":"",
    "Localidad":"",
    "Calle":"",
    "Numero":"",
    "CodigoPostal":"",
    "Marca":"Bandera Blanca",
    "Operador":"",
    "Telefono":"",
    "OSM":5058704508
    }
  },
  {
    "type": "Feature",
    "geometry": {
       "type": "Point",
       "coordinates":  [ -54.6180299,-26.3387991 ]
    },
    "properties": {
    "Nombre":"Axion",
    "Localidad":"",
    "Calle":"",
    "Numero":"",
    "CodigoPostal":"",
    "Marca":"Axion",
    "Operador":"",
    "Telefono":"",
    "OSM":5153704131
    }
  },
  {
    "type": "Feature",
    "geometry": {
       "type": "Point",
       "coordinates":  [ -55.9433286,-27.3996443 ]
    },
    "properties": {
    "Nombre":"YPF",
    "Localidad":"Posadas",
    "Calle":"Avenida Quaranta",
    "Numero":6498,
    "CodigoPostal":3300,
    "Marca":"YPF",
    "Operador":"Sartori S.A.",
    "Telefono":"",
    "OSM":5251691221
    }
  },
  {
    "type": "Feature",
    "geometry": {
       "type": "Point",
       "coordinates":  [ -54.9752214,-27.2084898 ]
    },
    "properties": {
    "Nombre":"",
    "Localidad":"",
    "Calle":"",
    "Numero":"",
    "CodigoPostal":"",
    "Marca":"Bandera Blanca",
    "Operador":"",
    "Telefono":"",
    "OSM":5324283846
    }
  },
  {
    "type": "Feature",
    "geometry": {
       "type": "Point",
       "coordinates":  [ -55.8750326,-27.443755 ]
    },
    "properties": {
    "Nombre":"Fátima Combustibles",
    "Localidad":"",
    "Calle":"",
    "Numero":"",
    "CodigoPostal":"",
    "Marca":"Bandera Blanca",
    "Operador":"",
    "Telefono":"",
    "OSM":5431871590
    }
  },
  {
    "type": "Feature",
    "geometry": {
       "type": "Point",
       "coordinates":  [ -55.9128084,-27.4152957 ]
    },
    "properties": {
    "Nombre":"YPF",
    "Localidad":"Posadas",
    "Calle":"Avenida Cocomarola",
    "Numero":"",
    "CodigoPostal":3300,
    "Marca":"YPF",
    "Operador":"",
    "Telefono":"",
    "OSM":5724327994
    }
  },
  {
    "type": "Feature",
    "geometry": {
       "type": "Point",
       "coordinates":  [ -55.6786091,-28.0640729 ]
    },
    "properties": {
    "Nombre":"",
    "Localidad":"",
    "Calle":"",
    "Numero":"",
    "CodigoPostal":"",
    "Marca":"Bandera Blanca",
    "Operador":"",
    "Telefono":"",
    "OSM":6160104877
    }
  },
  {
    "type": "Feature",
    "geometry": {
       "type": "Point",
       "coordinates":  [ -55.3191477,-27.6070264 ]
    },
    "properties": {
    "Nombre":"",
    "Localidad":"",
    "Calle":"",
    "Numero":"",
    "CodigoPostal":"",
    "Marca":"",
    "Operador":"",
    "Telefono":"",
    "OSM":6332160671
    }
  },
  {
    "type": "Feature",
    "geometry": {
       "type": "Point",
       "coordinates":  [ -54.6471951,-27.4755792 ]
    },
    "properties": {
    "Nombre":"Maybau",
    "Localidad":"",
    "Calle":"Ruta Provincial 2",
    "Numero":"",
    "CodigoPostal":"",
    "Marca":"",
    "Operador":"",
    "Telefono":"",
    "OSM":6333088585
    }
  },
  {
    "type": "Feature",
    "geometry": {
       "type": "Point",
       "coordinates":  [ -54.4494756,-27.3886099 ]
    },
    "properties": {
    "Nombre":"El Progreso",
    "Localidad":"Colonia Aurora",
    "Calle":"Ruta Provincial 2",
    "Numero":"",
    "CodigoPostal":3363,
    "Marca":"",
    "Operador":"",
    "Telefono":"",
    "OSM":6482925687
    }
  },
  {
    "type": "Feature",
    "geometry": {
       "type": "Point",
       "coordinates":  [ -54.5983708,-26.2386216 ]
    },
    "properties": {
    "Nombre":"Bandera Blanca Delicia",
    "Localidad":"",
    "Calle":"Ruta Nacional 12",
    "Numero":"",
    "CodigoPostal":"",
    "Marca":"",
    "Operador":"",
    "Telefono":"",
    "OSM":6530536385
    }
  },
  {
    "type": "Feature",
    "geometry": {
       "type": "Point",
       "coordinates":  [ -54.4872147,-26.9906713 ]
    },
    "properties": {
    "Nombre":"",
    "Localidad":"",
    "Calle":"",
    "Numero":"",
    "CodigoPostal":"",
    "Marca":"Axion",
    "Operador":"",
    "Telefono":"",
    "OSM":6644106659
    }
  },
  {
    "type": "Feature",
    "geometry": {
       "type": "Point",
       "coordinates":  [ -55.9226385,-27.3985815 ]
    },
    "properties": {
    "Nombre":"",
    "Localidad":"Posadas",
    "Calle":"Avenida Santa Cruz",
    "Numero":4290,
    "CodigoPostal":3300,
    "Marca":"Salustri",
    "Operador":"",
    "Telefono":"",
    "OSM":6778469685
    }
  },
  {
    "type": "Feature",
    "geometry": {
       "type": "Point",
       "coordinates":  [ -55.2674741,-27.8684241 ]
    },
    "properties": {
    "Nombre":"",
    "Localidad":"",
    "Calle":"",
    "Numero":"",
    "CodigoPostal":"",
    "Marca":"",
    "Operador":"",
    "Telefono":"",
    "OSM":6937090519
    }
  },
  {
    "type": "Feature",
    "geometry": {
       "type": "Point",
       "coordinates":  [ -53.9410989,-26.5361486 ]
    },
    "properties": {
    "Nombre":"",
    "Localidad":"",
    "Calle":"",
    "Numero":"",
    "CodigoPostal":"",
    "Marca":"",
    "Operador":"",
    "Telefono":"",
    "OSM":7106686158
    }
  },
  {
    "type": "Feature",
    "geometry": {
       "type": "Point",
       "coordinates":  [ -55.8525413,-27.4474849 ]
    },
    "properties": {
    "Nombre":"",
    "Localidad":"",
    "Calle":"",
    "Numero":"",
    "CodigoPostal":"",
    "Marca":"",
    "Operador":"",
    "Telefono":"",
    "OSM":7279362272
    }
  },
  {
    "type": "Feature",
    "geometry": {
       "type": "Point",
       "coordinates":  [ -54.0514104,-25.6944467 ]
    },
    "properties": {
    "Nombre":"Petrovalle SA",
    "Localidad":"Andresito",
    "Calle":"Ruta Provincial 19",
    "Numero":"",
    "CodigoPostal":"",
    "Marca":"YPF",
    "Operador":"",
    "Telefono":"",
    "OSM":7339677353
    }
  },
  {
    "type": "Feature",
    "geometry": {
       "type": "Point",
       "coordinates":  [ -54.0476533,-25.6641413 ]
    },
    "properties": {
    "Nombre":"Bruera Hermanos",
    "Localidad":"Comandante Andresito",
    "Calle":"Avenida Primero de Mayo",
    "Numero":"",
    "CodigoPostal":3385,
    "Marca":"",
    "Operador":"",
    "Telefono":"",
    "OSM":7339677394
    }
  }
]
}
