{
   "type": "FeatureCollection",
   "features": [
  {
    "type": "Feature",
    "geometry": {
       "type": "Point",
       "coordinates":  [ -55.70662459060,-27.55606619940 ]
    },
    "properties": {
    "Nombre":"Destacamento Profundidad"
    }
  },
  {
    "type": "Feature",
    "geometry": {
       "type": "Point",
       "coordinates":  [ -55.59213428850,-27.28683404970 ]
    },
    "properties": {
    "Nombre":"Destacamento Teyú Cuaré"
    }
  },
  {
    "type": "Feature",
    "geometry": {
       "type": "Point",
       "coordinates":  [ -54.82642835410,-27.06239297440 ]
    },
    "properties": {
    "Nombre":"Destacamento Salto Ecantado"
    }
  },
  {
    "type": "Feature",
    "geometry": {
       "type": "Point",
       "coordinates":  [ -53.97488065800,-26.51392032420 ]
    },
    "properties": {
    "Nombre":"Destacamento Cruce Caballero"
    }
  },
  {
    "type": "Feature",
    "geometry": {
       "type": "Point",
       "coordinates":  [ -53.90297726920,-27.15092009840 ]
    },
    "properties": {
    "Nombre":"Destacamento Moconá"
    }
  },
  {
    "type": "Feature",
    "geometry": {
       "type": "Point",
       "coordinates":  [ -53.87820070070,-26.89347574080 ]
    },
    "properties": {
    "Nombre":"Destacamento Esmeralda"
    }
  },
  {
    "type": "Feature",
    "geometry": {
       "type": "Point",
       "coordinates":  [ -53.85131300370,-26.43308975150 ]
    },
    "properties": {
    "Nombre":"Destacamento Piñalito"
    }
  },
  {
    "type": "Feature",
    "geometry": {
       "type": "Point",
       "coordinates":  [ -54.00110024030,-25.84014491250 ]
    },
    "properties": {
    "Nombre":"Destacamento 101"
    }
  },
  {
    "type": "Feature",
    "geometry": {
       "type": "Point",
       "coordinates":  [ -53.86547811160,-25.84285287480 ]
    },
    "properties": {
    "Nombre":"Destacamento Foester"
    }
  },
  {
    "type": "Feature",
    "geometry": {
       "type": "Point",
       "coordinates":  [ -54.16877952100,-25.85849242430 ]
    },
    "properties": {
    "Nombre":"Destacamento Uruzú"
    }
  },
  {
    "type": "Feature",
    "geometry": {
       "type": "Point",
       "coordinates":  [ -54.10197979720,-26.62727806870 ]
    },
    "properties": {
    "Nombre":"Destacamento Araucaria"
    }
  },
  {
    "type": "Feature",
    "geometry": {
       "type": "Point",
       "coordinates":  [ -55.71702300000,-27.67339599920 ]
    },
    "properties": {
    "Nombre":"Destacamento Fachinal"
    }
  },
  {
    "type": "Feature",
    "geometry": {
       "type": "Point",
       "coordinates":  [ -54.82908000000,-27.03724599920 ]
    },
    "properties": {
    "Nombre":"Destacamento Cerro 20"
    }
  },
  {
    "type": "Feature",
    "geometry": {
       "type": "Point",
       "coordinates":  [ -54.79572600000,-26.56757999920 ]
    },
    "properties": {
    "Nombre":"Destacamento Solar Che Guevara"
    }
  },
  {
    "type": "Feature",
    "geometry": {
       "type": "Point",
       "coordinates":  [ -54.24447800000,-26.88634899920 ]
    },
    "properties": {
    "Nombre":"Destacamento Caá-Yarí"
    }
  },
  {
    "type": "Feature",
    "geometry": {
       "type": "Point",
       "coordinates":  [ -54.11448289780,-26.62547590120 ]
    },
    "properties": {
    "Nombre":"Destacamento AMIRBY"
    }
  },
  {
    "type": "Feature",
    "geometry": {
       "type": "Point",
       "coordinates":  [ -54.27598709540,-25.92483445340 ]
    },
    "properties": {
    "Nombre":"Destacamento Uruzú 1"
    }
  },
  {
    "type": "Feature",
    "geometry": {
       "type": "Point",
       "coordinates":  [ -54.11673507430,-25.76012689950 ]
    },
    "properties": {
    "Nombre":"Destacamento Uruzú 2"
    }
  },
  {
    "type": "Feature",
    "geometry": {
       "type": "Point",
       "coordinates":  [ -54.06332170670,-25.66890326590 ]
    },
    "properties": {
    "Nombre":"Destacamento Cabureí"
    }
  },
  {
    "type": "Feature",
    "geometry": {
       "type": "Point",
       "coordinates":  [ -54.51803200000,-25.71142699930 ]
    },
    "properties": {
    "Nombre":"Destacamento Puerto Península"
    }
  },
  {
    "type": "Feature",
    "geometry": {
       "type": "Point",
       "coordinates":  [ -55.56553817370,-27.74435844010 ]
    },
    "properties": {
    "Nombre":"Destacamento Parque Provincial de la Sierra"
    }
  },
  {
    "type": "Feature",
    "geometry": {
       "type": "Point",
       "coordinates":  [ -54.55884694830,-25.87549767960 ]
    },
    "properties": {
    "Nombre":"Destacamento Ecolacustre Lago Uruguaí"
    }
  }
]
}