{
  "type": "FeatureCollection",
  "generator": "overpass-ide",
  "copyright": "The data included in this document is from www.openstreetmap.org. The data is made available under ODbL.",
  "timestamp": "2020-03-29T11:59:02Z",
  "features": [
    {
      "type": "Feature",
      "properties": {
        "@id": "node/870955589",
        "addr:city": "San Pedro",
        "addr:postcode": "3352",
        "addr:street": "Almirante Brown",
        "amenity": "hospital",
        "emergency": "yes",
        "healthcare": "hospital",
        "name": "Hospital de San Pedro",
        "phone": "+54 3751 470010",
        "phone_1": "+54 3751 425207",
        "phone_2": "+54 3751 426383",
        "source": "http://www.salud.misiones.gov.ar/index.php/red-sanitaria/hospitales"
      },
      "geometry": {
        "type": "Point",
        "coordinates": [
          -54.1078255,
          -26.6186912
        ]
      },
      "id": "node/870955589"
    },
    {
      "type": "Feature",
      "properties": {
        "@id": "node/1393564169",
        "addr:city": "Montecarlo",
        "addr:housenumber": "117",
        "addr:street": "Comandante Andresito",
        "alt_name": "Hospital de Área Montecarlo",
        "amenity": "hospital",
        "emergency": "yes",
        "name": "Hospital Montecarlo Doctor Oscar Eugenio Darú",
        "phone": "+54 3751 480020",
        "source": "http://www.salud.misiones.gov.ar/index.php/red-sanitaria/hospitales"
      },
      "geometry": {
        "type": "Point",
        "coordinates": [
          -54.7665377,
          -26.5684384
        ]
      },
      "id": "node/1393564169"
    },
    {
      "type": "Feature",
      "properties": {
        "@id": "node/1698682689",
        "addr:city": "Posadas",
        "addr:country": "AR",
        "addr:street": "Avenida Quaranta",
        "amenity": "hospital",
        "emergency": "yes",
        "name": "Hospital Ramón Carrillo",
        "phone": "+5 376 4458263"
      },
      "geometry": {
        "type": "Point",
        "coordinates": [
          -55.9523281,
          -27.3985158
        ]
      },
      "id": "node/1698682689"
    },
    {
      "type": "Feature",
      "properties": {
        "@id": "node/1698683341",
        "addr:city": "Posadas",
        "addr:country": "AR",
        "addr:street": "Avenida Quaranta",
        "amenity": "hospital",
        "description": "Hospital psiquiátrico",
        "emergency": "no",
        "name": "Hospital Doctor Pedro Baliña",
        "phone": "+54 376 4458248"
      },
      "geometry": {
        "type": "Point",
        "coordinates": [
          -55.9512123,
          -27.3985292
        ]
      },
      "id": "node/1698683341"
    },
    {
      "type": "Feature",
      "properties": {
        "@id": "node/2604527696",
        "addr:city": "Capioví",
        "addr:housenumber": "400",
        "addr:street": "Avenida San Luis Gonzaga",
        "amenity": "hospital",
        "emergency": "yes",
        "name": "Hospital \"René Favaloro\"",
        "phone": "+54 3743 493299",
        "source": "http://www.salud.misiones.gov.ar/index.php/red-sanitaria/hospitales"
      },
      "geometry": {
        "type": "Point",
        "coordinates": [
          -55.0578671,
          -26.9277421
        ]
      },
      "id": "node/2604527696"
    },
    {
      "type": "Feature",
      "properties": {
        "@id": "node/2613102628",
        "addr:city": "Concepción de la Sierra",
        "addr:postcode": "3355",
        "addr:street": "Avenida Gonzalo de Doblas",
        "amenity": "hospital",
        "description": "Hospital zonal de Nivel 1",
        "emergency": "yes",
        "name": "Hospital de Área",
        "source": "Neco Barrios y Asociados para el \"Gran Atlas de Misiones\" (IPEC, 2012)."
      },
      "geometry": {
        "type": "Point",
        "coordinates": [
          -55.5137438,
          -27.9818261
        ]
      },
      "id": "node/2613102628"
    },
    {
      "type": "Feature",
      "properties": {
        "@id": "node/3648050736",
        "addr:housenumber": "1800",
        "addr:street": "Tupac Amarú",
        "amenity": "hospital",
        "emergency": "yes",
        "fixme": "Verificar la posicion eacta",
        "name": "Hospital SAMIC de San Vicente",
        "phone": "+54 3755 461840"
      },
      "geometry": {
        "type": "Point",
        "coordinates": [
          -54.4782897,
          -26.9932289
        ]
      },
      "id": "node/3648050736"
    },
    {
      "type": "Feature",
      "properties": {
        "@id": "node/3648887420",
        "addr:housenumber": "12",
        "addr:street": "Avenida José Invernizzi",
        "amenity": "hospital",
        "emergency": "yes",
        "fixme": "Verificar la posicion exacta",
        "name": "Hospital de Colonia Delicia",
        "phone": "+54 3751 427777",
        "source": "http://www.salud.misiones.gov.ar/index.php/red-sanitaria/hospitales"
      },
      "geometry": {
        "type": "Point",
        "coordinates": [
          -54.6043156,
          -26.2321945
        ]
      },
      "id": "node/3648887420"
    },
    {
      "type": "Feature",
      "properties": {
        "@id": "node/3659043803",
        "addr:city": "San José",
        "addr:housenumber": "829",
        "addr:postcode": "3307",
        "addr:street": "Islas Malvinas Argentinas",
        "amenity": "hospital",
        "name": "Hospital de San José",
        "note": "Nivel 1 ",
        "phone": "+54 3758 492213",
        "source": "http://www.salud.misiones.gov.ar/index.php/red-sanitaria/hospitales"
      },
      "geometry": {
        "type": "Point",
        "coordinates": [
          -55.7807166,
          -27.7681279
        ]
      },
      "id": "node/3659043803"
    },
    {
      "type": "Feature",
      "properties": {
        "@id": "node/4112790623",
        "addr:city": "Campo Grande",
        "addr:postcode": "3362",
        "addr:street": "Pasteur",
        "alt_name": "Hospital Nivel I de Campo Grande",
        "alt_name_1": "Unidad Sanitaria de Nivel I",
        "amenity": "hospital",
        "emergency": "yes",
        "name": "Hospital Nivel I",
        "phone": "+54 3755 499190",
        "source": "http://www.salud.misiones.gov.ar/index.php/red-sanitaria/hospitales"
      },
      "geometry": {
        "type": "Point",
        "coordinates": [
          -54.9781751,
          -27.2040827
        ]
      },
      "id": "node/4112790623"
    },
    {
      "type": "Feature",
      "properties": {
        "@id": "node/4223573167",
        "amenity": "hospital"
      },
      "geometry": {
        "type": "Point",
        "coordinates": [
          -54.4766115,
          -26.9882057
        ]
      },
      "id": "node/4223573167"
    },
    {
      "type": "Feature",
      "properties": {
        "@id": "node/4373094690",
        "addr:city": "San Vicente",
        "addr:housenumber": "289",
        "addr:postcode": "3364",
        "addr:street": "Avenida Constitución",
        "amenity": "hospital",
        "facebook": "https://www.facebook.com/sanatoriosanmarcos/",
        "name": "Cllínica San Marcos",
        "phone": "+54 3755 460064"
      },
      "geometry": {
        "type": "Point",
        "coordinates": [
          -54.4805229,
          -26.9978822
        ]
      },
      "id": "node/4373094690"
    },
    {
      "type": "Feature",
      "properties": {
        "@id": "node/4423611899",
        "addr:city": "Comandante Andresito",
        "addr:postcode": "3385",
        "addr:street": "Avenida El Libertador",
        "amenity": "hospital",
        "emergency": "yes",
        "healthcare": "hospital",
        "name": "Hospital Almirante Brown",
        "phone": "+54 3757 497061",
        "ref:nivel": "I"
      },
      "geometry": {
        "type": "Point",
        "coordinates": [
          -54.0489418,
          -25.667128
        ]
      },
      "id": "node/4423611899"
    },
    {
      "type": "Feature",
      "properties": {
        "@id": "node/4423695520",
        "addr:city": "Garupá",
        "addr:housenumber": "1576",
        "addr:postcode": "3304",
        "addr:street": "Avenida Jorge Kemerer",
        "amenity": "hospital",
        "emergency": "yes",
        "healthcare": "hospital",
        "name": "Hospital Virgen de Fátima",
        "note": "Nivel I",
        "phone": "+54 376 4409118",
        "source": "http://www.salud.misiones.gov.ar/index.php/red-sanitaria/hospitales"
      },
      "geometry": {
        "type": "Point",
        "coordinates": [
          -55.8695798,
          -27.4364015
        ]
      },
      "id": "node/4423695520"
    },
    {
      "type": "Feature",
      "properties": {
        "@id": "node/4424281147",
        "addr:city": "Eldorado",
        "addr:postcode": "3380",
        "addr:street": "Doctor Prieto",
        "amenity": "hospital",
        "emergency": "yes",
        "healthcare": "hospital",
        "healthcare:speciality": "general;paediatrics;radiology;emergency;surgery;cardiology;maternity",
        "name": "Hospital SAMIC Eldorado",
        "note": "Nivel III",
        "phone": "+54 3751 421536",
        "source": "http://www.salud.misiones.gov.ar/red-sanitaria/hospitales"
      },
      "geometry": {
        "type": "Point",
        "coordinates": [
          -54.5972769,
          -26.4048225
        ]
      },
      "id": "node/4424281147"
    },
    {
      "type": "Feature",
      "properties": {
        "@id": "node/4424289354",
        "addr:city": "Oberá",
        "addr:street": "Avenida Pincén",
        "amenity": "hospital",
        "emergency": "yes",
        "name": "Hospital SAMIC de Oberá",
        "note": "Nivel III",
        "phone": "+54 3755 421227",
        "source": "http://www.salud.misiones.gov.ar/red-sanitaria/hospitales"
      },
      "geometry": {
        "type": "Point",
        "coordinates": [
          -55.1445208,
          -27.4923502
        ]
      },
      "id": "node/4424289354"
    },
    {
      "type": "Feature",
      "properties": {
        "@id": "node/4424295826",
        "addr:city": "Jardin América",
        "addr:housenumber": "575",
        "addr:street": "Aconcagua",
        "amenity": "hospital",
        "emergency": "yes",
        "name": "Hospital “Doctor Tadayoshi Kamada”",
        "phone": "+54 3743 460174",
        "source": "http://www.salud.misiones.gov.ar/red-sanitaria/hospitales"
      },
      "geometry": {
        "type": "Point",
        "coordinates": [
          -55.2296101,
          -27.0384763
        ]
      },
      "id": "node/4424295826"
    },
    {
      "type": "Feature",
      "properties": {
        "@id": "node/4424308453",
        "addr:city": "Apóstoles",
        "addr:housenumber": "569",
        "addr:postcode": "3350",
        "addr:street": "Tucumán",
        "amenity": "hospital",
        "emergency": "yes",
        "healthcare": "hospital",
        "name": "Hospital “Doctor Bernardo Allassia”",
        "note": "NIvel II",
        "phone": "+54 3758 422666",
        "source": "http://www.salud.misiones.gov.ar/red-sanitaria/hospitales"
      },
      "geometry": {
        "type": "Point",
        "coordinates": [
          -55.7503429,
          -27.9075657
        ]
      },
      "id": "node/4424308453"
    },
    {
      "type": "Feature",
      "properties": {
        "@id": "node/4424477989",
        "addr:city": "Candelaria",
        "addr:housenumber": "836",
        "addr:street": "Avenida San Roque González",
        "amenity": "hospital",
        "emergency": "yes",
        "name": "Hospital de Candelaria",
        "note": "Nivel I",
        "phone": "+54 376 4493212"
      },
      "geometry": {
        "type": "Point",
        "coordinates": [
          -55.7452336,
          -27.4623676
        ]
      },
      "id": "node/4424477989"
    },
    {
      "type": "Feature",
      "properties": {
        "@id": "node/4424480589",
        "addr:city": "Santa Ana",
        "addr:full": "Avenida Manuel Belgrano y Antonio Melo",
        "addr:street": "Avenida Manuel Belgrano",
        "amenity": "hospital",
        "emergency": "yes",
        "healthcare": "hospital",
        "name": "Hospital de Santa Ana",
        "phone": "+54 376 4497127"
      },
      "geometry": {
        "type": "Point",
        "coordinates": [
          -55.5805891,
          -27.3689134
        ]
      },
      "id": "node/4424480589"
    },
    {
      "type": "Feature",
      "properties": {
        "@id": "node/4424482963",
        "addr:city": "San Ignacio",
        "addr:housenumber": "635",
        "addr:postcode": "3322",
        "addr:street": "Avenida Horacio Quiroga",
        "alt_name": "Hospital H. Valdovino",
        "amenity": "hospital",
        "emergency": "yes",
        "healthcare": "hospital",
        "name": "Hospital de San Ignacio",
        "phone": "+54 376 4470007",
        "ref:nivel": "I",
        "source": "http://www.salud.misiones.gov.ar/index.php/red-sanitaria/hospitales"
      },
      "geometry": {
        "type": "Point",
        "coordinates": [
          -55.5408046,
          -27.2556211
        ]
      },
      "id": "node/4424482963"
    },
    {
      "type": "Feature",
      "properties": {
        "@id": "node/4424484084",
        "addr:city": "Gobernador Roca",
        "addr:postcode": "3324",
        "addr:street": "Rivadavia",
        "amenity": "hospital",
        "emergency": "yes",
        "name": "Hospital de Gobernador Roca",
        "phone": "+54 376 4498017",
        "source": "http://www.salud.misiones.gov.ar/index.php/red-sanitaria/hospitales"
      },
      "geometry": {
        "type": "Point",
        "coordinates": [
          -55.465774,
          -27.1839878
        ]
      },
      "id": "node/4424484084"
    },
    {
      "type": "Feature",
      "properties": {
        "@id": "node/4424489402",
        "addr:city": "Corpus",
        "addr:postcode": "3327",
        "addr:street": "Avenida Curupaity",
        "amenity": "hospital",
        "emergency": "yes",
        "fixme": "Verificar la posicion exacta",
        "name": "Hospital de Corpus",
        "phone": "+54 376 4495044",
        "source": "http://www.salud.misiones.gov.ar/index.php/red-sanitaria/hospitales"
      },
      "geometry": {
        "type": "Point",
        "coordinates": [
          -55.5121088,
          -27.1309739
        ]
      },
      "id": "node/4424489402"
    },
    {
      "type": "Feature",
      "properties": {
        "@id": "node/4424492396",
        "addr:city": "Puerto Rico",
        "addr:housenumber": "55",
        "addr:postcode": "3334",
        "addr:street": "Doctor Ricardo Gutiérrez",
        "amenity": "hospital",
        "emergency": "yes",
        "name": "Hospital de área “Doctor Ricardo Gutierrez”",
        "phone": "+54 3743 420520",
        "phone_1": "+54 3743 420544",
        "phone_2": "107"
      },
      "geometry": {
        "type": "Point",
        "coordinates": [
          -55.0274185,
          -26.8152608
        ]
      },
      "id": "node/4424492396"
    },
    {
      "type": "Feature",
      "properties": {
        "@id": "node/4424495431",
        "addr:city": "Puerto Piray",
        "addr:postcode": "3381",
        "addr:street": "Avenida Marcos Paz",
        "amenity": "hospital",
        "emergency": "yes",
        "name": "Hospital de Puerto Piray",
        "phone": "+54 3751 461325",
        "source": "http://www.salud.misiones.gov.ar/index.php/red-sanitaria/hospitales"
      },
      "geometry": {
        "type": "Point",
        "coordinates": [
          -54.7050275,
          -26.4670588
        ]
      },
      "id": "node/4424495431"
    },
    {
      "type": "Feature",
      "properties": {
        "@id": "node/4424502672",
        "addr:city": "Puerto Esperanza",
        "addr:street": "Nicaragua",
        "amenity": "hospital",
        "emergency": "yes",
        "healthcare": "hospital",
        "name": "Hospital de Puerto Esperanza",
        "phone": "+54 3757 480197",
        "ref:nivel": "I",
        "source": "http://www.salud.misiones.gov.ar/index.php/red-sanitaria/hospitales"
      },
      "geometry": {
        "type": "Point",
        "coordinates": [
          -54.6059915,
          -26.0218443
        ]
      },
      "id": "node/4424502672"
    },
    {
      "type": "Feature",
      "properties": {
        "@id": "node/4424508939",
        "addr:city": "Puerto Libertad",
        "addr:housenumber": "1331",
        "addr:street": "Avenida Juan Domingo Perón",
        "amenity": "hospital",
        "healthcare": "hospital",
        "name": "Hospital de Puerto Libertad",
        "phone": "+54 3757 496055",
        "ref:nivel": "I"
      },
      "geometry": {
        "type": "Point",
        "coordinates": [
          -54.5885182,
          -25.9212068
        ]
      },
      "id": "node/4424508939"
    },
    {
      "type": "Feature",
      "properties": {
        "@id": "node/4424509850",
        "addr:housenumber": "142",
        "addr:street": "Avenida Victoria Aguirre",
        "amenity": "hospital",
        "emergency": "yes",
        "healthcare": "hospital",
        "name": "Hospital S.A.M.I.C. \"Doctora. Marta Schwartz\"",
        "phone": "+54 3757 420626",
        "source": "http://www.salud.misiones.gov.ar/index.php/red-sanitaria/hospitales"
      },
      "geometry": {
        "type": "Point",
        "coordinates": [
          -54.5736932,
          -25.601183
        ]
      },
      "id": "node/4424509850"
    },
    {
      "type": "Feature",
      "properties": {
        "@id": "node/4424981817",
        "addr:city": "San Antonio",
        "addr:housenumber": "750",
        "addr:street": "Avenida Andresito",
        "amenity": "hospital",
        "emergency": "yes",
        "fixme": "Verificar la posición exacta",
        "name": "Hospital de San Antonio",
        "phone": "+54 3741 493054"
      },
      "geometry": {
        "type": "Point",
        "coordinates": [
          -53.7357857,
          -26.0563252
        ]
      },
      "id": "node/4424981817"
    },
    {
      "type": "Feature",
      "properties": {
        "@id": "node/4424986133",
        "addr:city": "Bernardo de Irigoyen",
        "addr:housenumber": "290",
        "addr:street": "Avenida de Las Américas",
        "amenity": "hospital",
        "emergency": "yes",
        "name": "Hospital de Bernardo de Irigoyen",
        "phone": "+54 3741 420201"
      },
      "geometry": {
        "type": "Point",
        "coordinates": [
          -53.65148,
          -26.2493166
        ]
      },
      "id": "node/4424986133"
    },
    {
      "type": "Feature",
      "properties": {
        "@id": "node/4425015718",
        "addr:city": "Veinticinco de Mayo",
        "addr:housenumber": "22",
        "addr:street": "Comandante Andresito",
        "amenity": "hospital",
        "emergency": "yes",
        "name": "Hospital de 25 de Mayo",
        "source": "http://www.salud.misiones.gov.ar/index.php/red-sanitaria/hospitales"
      },
      "geometry": {
        "type": "Point",
        "coordinates": [
          -54.7442249,
          -27.3791759
        ]
      },
      "id": "node/4425015718"
    },
    {
      "type": "Feature",
      "properties": {
        "@id": "node/4425942392",
        "addr:city": "Dos de Mayo",
        "addr:street": "Perú",
        "amenity": "hospital",
        "emergency": "yes",
        "name": "Hospital de Dos de Mayo",
        "phone": "+54 3755 496715"
      },
      "geometry": {
        "type": "Point",
        "coordinates": [
          -54.687661,
          -27.0168158
        ]
      },
      "id": "node/4425942392"
    },
    {
      "type": "Feature",
      "properties": {
        "@id": "node/4425972117",
        "addr:city": "Aristóbulo del Valle",
        "addr:housenumber": "2001",
        "addr:postcode": "3364",
        "addr:street": "Corrientes",
        "amenity": "hospital",
        "emergency": "yes",
        "name": "Hospital de Aristóbulo del Valle Dr. Justo José Pereyra",
        "operator": "Ministerio de Salud de la Provincia de Misiones",
        "phone": "+54 3755 471001",
        "source": "http://www.salud.misiones.gov.ar/index.php/red-sanitaria/hospitales"
      },
      "geometry": {
        "type": "Point",
        "coordinates": [
          -54.888261,
          -27.10427
        ]
      },
      "id": "node/4425972117"
    },
    {
      "type": "Feature",
      "properties": {
        "@id": "node/4425974806",
        "addr:city": "Alba Posse",
        "addr:postcode": "3364",
        "addr:street": "Ruta Provincial 8",
        "amenity": "hospital",
        "name": "Hospital \"Doctor Ricardo Alba Posse\"",
        "phone": "+54 3755 482011"
      },
      "geometry": {
        "type": "Point",
        "coordinates": [
          -54.6831892,
          -27.5653172
        ]
      },
      "id": "node/4425974806"
    },
    {
      "type": "Feature",
      "properties": {
        "@id": "node/4425975831",
        "addr:city": "Leandro N. Alem",
        "addr:housenumber": "710",
        "addr:postcode": "3315",
        "addr:street": "Rivadavia",
        "amenity": "hospital",
        "emergency": "yes",
        "name": "Hospital SAMIC “Doctor Juan Fernando Alegre”",
        "phone": "+54 3754 420290"
      },
      "geometry": {
        "type": "Point",
        "coordinates": [
          -55.3299219,
          -27.6082916
        ]
      },
      "id": "node/4425975831"
    },
    {
      "type": "Feature",
      "properties": {
        "@id": "node/4425976260",
        "addr:city": "Cerro Azul",
        "addr:housenumber": "900",
        "addr:street": "Tomás Guido",
        "amenity": "hospital",
        "emergency": "yes",
        "fixme": "Verificar la posicion exacta",
        "name": "Hospital de Cerro Azul",
        "phone": "+54 376 4494208",
        "source": "http://www.salud.misiones.gov.ar/index.php/red-sanitaria/hospitales"
      },
      "geometry": {
        "type": "Point",
        "coordinates": [
          -55.4986587,
          -27.6356816
        ]
      },
      "id": "node/4425976260"
    },
    {
      "type": "Feature",
      "properties": {
        "@id": "node/4425977869",
        "addr:city": "Bonpland",
        "addr:street": "Juan Lavalle",
        "amenity": "hospital",
        "emergency": "yes",
        "name": "Hospital de Bonpland",
        "phone": "+54 376 4492053",
        "source": "http://www.salud.misiones.gov.ar/index.php/red-sanitaria/hospitales"
      },
      "geometry": {
        "type": "Point",
        "coordinates": [
          -55.4726302,
          -27.4844519
        ]
      },
      "id": "node/4425977869"
    },
    {
      "type": "Feature",
      "properties": {
        "@id": "node/4426017497",
        "addr:city": "Posadas",
        "addr:housenumber": "7300",
        "addr:street": "Avenida Tambor de Tacuarí",
        "amenity": "hospital",
        "emergency": "yes",
        "name": "Hospital \"Doctor René Favaloro\"",
        "phone": "+54 376 4468015",
        "source": "http://www.salud.misiones.gov.ar/index.php/red-sanitaria/hospitales"
      },
      "geometry": {
        "type": "Point",
        "coordinates": [
          -55.949421,
          -27.3651406
        ]
      },
      "id": "node/4426017497"
    },
    {
      "type": "Feature",
      "properties": {
        "@id": "node/4952478659",
        "addr:street": "Avenida San Martín",
        "amenity": "hospital",
        "name": "Hospital Colonia Aurora"
      },
      "geometry": {
        "type": "Point",
        "coordinates": [
          -54.530216,
          -27.4773346
        ]
      },
      "id": "node/4952478659"
    },
    {
      "type": "Feature",
      "properties": {
        "@id": "node/5331224113",
        "addr:city": "Montecarlo",
        "addr:postcode": "3384",
        "addr:street": "Neuquén",
        "amenity": "hospital",
        "name": "Hospital de Área Montecarlo",
        "opening_hours": "24/7",
        "phone": "480020"
      },
      "geometry": {
        "type": "Point",
        "coordinates": [
          -54.734397,
          -26.5732254
        ]
      },
      "id": "node/5331224113"
    },
    {
      "type": "Feature",
      "properties": {
        "@id": "node/6125725230",
        "addr:city": "Colonia Wanda",
        "addr:postcode": "3376",
        "addr:street": "Avenida San Martín",
        "amenity": "hospital",
        "description": "Av. San Martin - Wanda - Misiones Datos Catastrales: Depto.09 - Mun. 24 - Secc. 04 - Chac. 000 - Manz. 0080 - Parc. 0001\nEmpresa: Forestal La Rama S.A.",
        "healthcare": "hospital",
        "name": "Hospital Nivel I",
        "source": "http://www.cadenadelsol.com.ar/?a=211948&PHPSESSID=2ce77ab122584ee0f37d32b2c339c9cf"
      },
      "geometry": {
        "type": "Point",
        "coordinates": [
          -54.5562924,
          -25.9716579
        ]
      },
      "id": "node/6125725230"
    },
    {
      "type": "Feature",
      "properties": {
        "@id": "node/6237978660",
        "addr:city": "San Javier",
        "addr:housenumber": "121",
        "addr:postcode": "3357",
        "addr:street": "Estanislao Lassaga",
        "alt_name": "Hospital Doctor Lizardo Morales",
        "amenity": "hospital",
        "emergency": "yes",
        "healthcare": "hospital",
        "healthcare:speciality": "general",
        "name": "Hospital de San Javier",
        "phone": "+54 3754 483031",
        "ref:nivel": "I"
      },
      "geometry": {
        "type": "Point",
        "coordinates": [
          -55.1376347,
          -27.8690037
        ]
      },
      "id": "node/6237978660"
    },
    {
      "type": "Feature",
      "properties": {
        "@id": "node/6394649145",
        "addr:city": "San Vicente",
        "addr:housenumber": "870",
        "addr:postcode": "3356",
        "addr:street": "Avenida Libertador",
        "amenity": "hospital",
        "facebook": "https://www.facebook.com/SanatorioAltosdelParana/",
        "healthcare": "hospital",
        "name": "Sanatorio Altos del Paraná",
        "phone": "+54 3755 460315"
      },
      "geometry": {
        "type": "Point",
        "coordinates": [
          -54.4848634,
          -26.9967647
        ]
      },
      "id": "node/6394649145"
    },
    {
      "type": "Feature",
      "properties": {
        "@id": "node/7314921272",
        "addr:street": "Ruta Provincial 7",
        "amenity": "hospital",
        "healthcare": "hospital"
      },
      "geometry": {
        "type": "Point",
        "coordinates": [
          -55.2189722,
          -27.0372591
        ]
      },
      "id": "node/7314921272"
    },
    {
      "type": "Feature",
      "properties": {
        "@id": "node/7341453369",
        "addr:city": "MIguel Lanús",
        "addr:housenumber": "2020",
        "addr:postcode": "3304",
        "addr:street": "Avenida Juan Domingo Perón",
        "amenity": "hospital",
        "healthcare": "hospital",
        "name": "Hospital Monoclínico de Geriatría Miguel Lanus"
      },
      "geometry": {
        "type": "Point",
        "coordinates": [
          -55.8851719,
          -27.4328143
        ]
      },
      "id": "node/7341453369"
    },
    {
      "type": "Feature",
      "properties": {
        "@id": "node/7341453370",
        "addr:city": "Eldorado",
        "addr:street": "Avenida San Martín Oeste",
        "amenity": "hospital",
        "healthcare": "hospital",
        "name": "Hospital SAMIC Eldorado",
        "note": "Hospital para la Atencion Primaria"
      },
      "geometry": {
        "type": "Point",
        "coordinates": [
          -54.6640252,
          -26.4075916
        ]
      },
      "id": "node/7341453370"
    },
    {
      "type": "Feature",
      "properties": {
        "@id": "node/7341455378",
        "addr:postcode": "3355",
        "addr:street": "Bartolomé Mitre",
        "amenity": "hospital",
        "emergency": "yes",
        "healthcare": "hospital",
        "name": "Hospital de Concepción de la Sierra",
        "phone": "+54 3758 470010"
      },
      "geometry": {
        "type": "Point",
        "coordinates": [
          -55.5210814,
          -27.9824684
        ]
      },
      "id": "node/7341455378"
    },
    {
      "type": "Feature",
      "properties": {
        "@id": "node/7341462783",
        "addr:city": "El Soberbio",
        "addr:postcode": "3368",
        "addr:street": "Chivilcoy",
        "amenity": "hospital",
        "emergency": "yes",
        "healthcare": "hospital",
        "name": "Hospital de El Soberbio",
        "phone": "+54 3755 495087",
        "source": "http://www.salud.misiones.gov.ar/index.php/red-sanitaria/hospitales",
        "website": "https://www.elsoberbio.gob.ar/?q=salud"
      },
      "geometry": {
        "type": "Point",
        "coordinates": [
          -54.2001193,
          -27.302679
        ]
      },
      "id": "node/7341462783"
    },
    {
      "type": "Feature",
      "properties": {
        "@id": "node/7341502567",
        "addr:city": "Azara",
        "addr:postcode": "3351",
        "addr:street": "Ucrania",
        "amenity": "hospital",
        "emergency": "yes",
        "healthcare": "hospital",
        "name": "Hospital de Azara",
        "phone": "+54 3758 493130",
        "source": "http://www.salud.misiones.gov.ar/index.php/red-sanitaria/hospitales"
      },
      "geometry": {
        "type": "Point",
        "coordinates": [
          -55.6759733,
          -28.0611286
        ]
      },
      "id": "node/7341502567"
    },
    {
      "type": "Feature",
      "properties": {
        "@id": "node/7341528392",
        "addr:city": "Posadas",
        "addr:housenumber": "6450",
        "addr:postcode": "3300",
        "addr:street": "Las Orquídeas",
        "amenity": "hospital",
        "building": "yes",
        "government": "healthcare",
        "healthcare": "hospital",
        "name": "Hospital de Nivel I Itaembé Guazú",
        "official_name": "Hospital de Nivel I de Itaembé Guazú"
      },
      "geometry": {
        "type": "Point",
        "coordinates": [
          -55.9838589,
          -27.410024
        ]
      },
      "id": "node/7341528392"
    }
  ]
}