%YAML 1.1
%TAG !u! tag:unity3d.com,2011:
--- !u!114 &11400000
MonoBehaviour:
  m_ObjectHideFlags: 0
  m_CorrespondingSourceObject: {fileID: 0}
  m_PrefabInternal: {fileID: 0}
  m_GameObject: {fileID: 0}
  m_Enabled: 1
  m_EditorHideFlags: 0
  m_Script: {fileID: 11500000, guid: f99611d556e2b9b44a948ec47eabe8fd, type: 3}
  m_Name: OneTile
  m_EditorClassIdentifier: 
  m_Sprite: {fileID: 21300000, guid: 9e1d55e92d6992043ad6630c652a6c58, type: 3}
  m_Color: {r: 1, g: 1, b: 1, a: 1}
  m_Transform:
    e00: 1
    e01: 0
    e02: 0
    e03: 0
    e10: 0
    e11: 1
    e12: 0
    e13: 0
    e20: 0
    e21: 0
    e22: 1
    e23: 0
    e30: 0
    e31: 0
    e32: 0
    e33: 1
  m_InstancedGameObject: {fileID: 1696534716768818, guid: 646a3cb24739d3547a47c85fb170a27d,
    type: 2}
  m_Flags: 0
  m_ColliderType: 0
