%YAML 1.1
%TAG !u! tag:unity3d.com,2011:
--- !u!114 &11400000
MonoBehaviour:
  m_ObjectHideFlags: 0
  m_CorrespondingSourceObject: {fileID: 0}
  m_PrefabInternal: {fileID: 0}
  m_GameObject: {fileID: 0}
  m_Enabled: 1
  m_EditorHideFlags: 0
  m_Script: {fileID: 11500000, guid: f99611d556e2b9b44a948ec47eabe8fd, type: 3}
  m_Name: PlatformPartTile
  m_EditorClassIdentifier: 
  m_Sprite: {fileID: 21300000, guid: c37c944c1e664774e8c6222395ae7905, type: 3}
  m_Color: {r: 1, g: 1, b: 1, a: 1}
  m_Transform:
    e00: 1
    e01: 0
    e02: 0
    e03: 0
    e10: 0
    e11: 1
    e12: 0
    e13: 0
    e20: 0
    e21: 0
    e22: 1
    e23: 0
    e30: 0
    e31: 0
    e32: 0
    e33: 1
  m_InstancedGameObject: {fileID: 1588724680958630, guid: db18b0f2f6ec7104283e6529407f70e2,
    type: 2}
  m_Flags: 0
  m_ColliderType: 0
