{
    "$schema": "http://json-schema.org/draft-04/schema#",
    "description": "",
    "type": "object",
    "properties": {
      "_id": {
        "type": "object",
        "properties": {
          "$oid": {
            "type": "string",
            "minLength": 1
          }
        },
        "required": [
          "$oid"
        ]
      },
      "name": {
        "type": "string",
        "minLength": 1
      },
      "height": {
        "type": "number"
      },
      "weight": {
        "type": "number"
      },
      "color": {
        "type": "string",
        "minLength": 1
      },
      "extinctionDate": {
        "type": "object",
        "properties": {
          "$date": {
            "type": "string",
            "minLength": 1
          }
        },
        "required": [
          "$date"
        ]
      }
    },
    "required": [
      "_id",
      "name",
      "height",
      "weight",
      "color",
      "extinctionDate"
    ]
  }