[gd_scene load_steps=4 format=2]

[ext_resource path="res://Assets/Player/platform1.png" type="Texture" id=1]

[sub_resource type="RectangleShape2D" id=4]
extents = Vector2( 8, 8 )

[sub_resource type="RectangleShape2D" id=1]
extents = Vector2( 5.5, 2 )

[node name="KinematicBody2D" type="KinematicBody2D"]

[node name="Sprite" type="Sprite" parent="."]
texture = ExtResource( 1 )
hframes = 7

[node name="CollisionShape2D" type="CollisionShape2D" parent="."]
shape = SubResource( 4 )

[node name="BreakPlatform" type="Area2D" parent="."]

[node name="CollisionShape2D2" type="CollisionShape2D" parent="BreakPlatform"]
position = Vector2( -0.5, -8 )
shape = SubResource( 1 )

[connection signal="body_entered" from="BreakPlatform" to="." method="_on_BreakPlatform_body_entered"]
