[gd_scene load_steps=2 format=2]

[sub_resource type="RectangleShape2D" id=1]
extents = Vector2( 18, 20 )

[node name="KinematicBody2D" type="KinematicBody2D"]
collision_layer = 8

[node name="CollisionShape2D" type="CollisionShape2D" parent="."]
position = Vector2( 26, 20 )
shape = SubResource( 1 )
