[gd_scene load_steps=4 format=2]

[ext_resource path="res://Assets/CheckPoint/checkpoint_flag.png" type="Texture" id=1]
[ext_resource path="res://Scenes/Prefabs/Bandeira.gd" type="Script" id=2]

[sub_resource type="RectangleShape2D" id=1]
extents = Vector2( 5, 16 )

[node name="Bandeira" type="Area2D"]
script = ExtResource( 2 )

[node name="Sprite" type="Sprite" parent="."]
texture = ExtResource( 1 )

[node name="CollisionShape2D" type="CollisionShape2D" parent="."]
position = Vector2( -3, 0 )
shape = SubResource( 1 )

[connection signal="body_entered" from="." to="." method="_on_Bandeira_body_entered"]
