\beamer@endinputifotherversion {3.36pt}
\headcommand {\slideentry {0}{0}{1}{1/1}{}{0}}
\headcommand {\beamer@framepages {1}{1}}
\headcommand {\slideentry {0}{0}{2}{2/2}{}{0}}
\headcommand {\beamer@framepages {2}{2}}
\headcommand {\slideentry {0}{0}{3}{3/3}{}{0}}
\headcommand {\beamer@framepages {3}{3}}
\headcommand {\sectionentry {1}{Sujet}{4}{Sujet}{0}}
\headcommand {\beamer@sectionpages {1}{3}}
\headcommand {\beamer@subsectionpages {1}{3}}
\headcommand {\slideentry {1}{0}{1}{4/4}{}{0}}
\headcommand {\beamer@framepages {4}{4}}
\headcommand {\sectionentry {2}{Beacons}{5}{Beacons}{0}}
\headcommand {\beamer@sectionpages {4}{4}}
\headcommand {\beamer@subsectionpages {4}{4}}
\headcommand {\beamer@subsectionentry {0}{2}{1}{5}{G\'en\'eralit\'es}}\headcommand {\beamer@subsectionpages {5}{4}}
\headcommand {\slideentry {2}{1}{1}{5/5}{G\'en\'eralit\'es}{0}}
\headcommand {\beamer@framepages {5}{5}}
\headcommand {\beamer@subsectionentry {0}{2}{2}{6}{iBeacon}}\headcommand {\beamer@subsectionpages {5}{5}}
\headcommand {\slideentry {2}{2}{1}{6/6}{iBeacon}{0}}
\headcommand {\beamer@framepages {6}{6}}
\headcommand {\beamer@subsectionentry {0}{2}{3}{7}{Utilisation sous iOS}}\headcommand {\beamer@subsectionpages {6}{6}}
\headcommand {\slideentry {2}{3}{1}{7/7}{Utilisation sous iOS}{0}}
\headcommand {\beamer@framepages {7}{7}}
\headcommand {\sectionentry {3}{Architecture}{8}{Architecture}{0}}
\headcommand {\beamer@sectionpages {5}{7}}
\headcommand {\beamer@subsectionpages {7}{7}}
\headcommand {\slideentry {3}{0}{1}{8/8}{}{0}}
\headcommand {\beamer@framepages {8}{8}}
\headcommand {\sectionentry {4}{Back-end}{9}{Back-end}{0}}
\headcommand {\beamer@sectionpages {8}{8}}
\headcommand {\beamer@subsectionpages {8}{8}}
\headcommand {\slideentry {4}{0}{1}{9/9}{}{0}}
\headcommand {\beamer@framepages {9}{9}}
\headcommand {\sectionentry {5}{Front-end}{10}{Front-end}{0}}
\headcommand {\beamer@sectionpages {9}{9}}
\headcommand {\beamer@subsectionpages {9}{9}}
\headcommand {\beamer@subsectionentry {0}{5}{1}{10}{Structure du programme}}\headcommand {\beamer@subsectionpages {10}{9}}
\headcommand {\slideentry {5}{1}{1}{10/10}{Structure du programme}{0}}
\headcommand {\beamer@framepages {10}{10}}
\headcommand {\beamer@subsectionentry {0}{5}{2}{11}{Interface \& D\'emonstration}}\headcommand {\beamer@subsectionpages {10}{10}}
\headcommand {\slideentry {5}{2}{1}{11/11}{Interface \& D\'emonstration}{0}}
\headcommand {\beamer@framepages {11}{11}}
\headcommand {\sectionentry {6}{Conclusion}{12}{Conclusion}{0}}
\headcommand {\beamer@sectionpages {10}{11}}
\headcommand {\beamer@subsectionpages {11}{11}}
\headcommand {\slideentry {6}{0}{1}{12/12}{}{0}}
\headcommand {\beamer@framepages {12}{12}}
\headcommand {\sectionentry {7}{Questions}{13}{Questions}{0}}
\headcommand {\beamer@sectionpages {12}{12}}
\headcommand {\beamer@subsectionpages {12}{12}}
\headcommand {\slideentry {7}{0}{1}{13/13}{}{0}}
\headcommand {\beamer@framepages {13}{13}}
\headcommand {\beamer@partpages {1}{13}}
\headcommand {\beamer@subsectionpages {13}{13}}
\headcommand {\beamer@sectionpages {13}{13}}
\headcommand {\beamer@documentpages {13}}
\headcommand {\def \inserttotalframenumber {13}}
