\relax 
\providecommand\hyper@newdestlabel[2]{}
\providecommand{\transparent@use}[1]{}
\providecommand\HyperFirstAtBeginDocument{\AtBeginDocument}
\HyperFirstAtBeginDocument{\ifx\hyper@anchor\@undefined
\global\let\oldcontentsline\contentsline
\gdef\contentsline#1#2#3#4{\oldcontentsline{#1}{#2}{#3}}
\global\let\oldnewlabel\newlabel
\gdef\newlabel#1#2{\newlabelxx{#1}#2}
\gdef\newlabelxx#1#2#3#4#5#6{\oldnewlabel{#1}{{#2}{#3}}}
\AtEndDocument{\ifx\hyper@anchor\@undefined
\let\contentsline\oldcontentsline
\let\newlabel\oldnewlabel
\fi}
\fi}
\global\let\hyper@last\relax 
\gdef\HyperFirstAtBeginDocument#1{#1}
\providecommand\HyField@AuxAddToFields[1]{}
\providecommand\HyField@AuxAddToCoFields[2]{}
\catcode `:\active 
\catcode `;\active 
\catcode `!\active 
\catcode `?\active 
\transparent@use{.8}
\transparent@use{.8}
\@writefile{toc}{\beamer@endinputifotherversion {3.36pt}}
\@writefile{nav}{\beamer@endinputifotherversion {3.36pt}}
\select@language{french}
\@writefile{toc}{\select@language{french}}
\@writefile{lof}{\select@language{french}}
\@writefile{lot}{\select@language{french}}
\@writefile{nav}{\headcommand {\slideentry {0}{0}{1}{1/1}{}{0}}}
\@writefile{nav}{\headcommand {\beamer@framepages {1}{1}}}
\transparent@use{.8}
\@writefile{nav}{\headcommand {\slideentry {0}{0}{2}{2/2}{}{0}}}
\@writefile{nav}{\headcommand {\beamer@framepages {2}{2}}}
\transparent@use{.8}
\@writefile{nav}{\headcommand {\slideentry {0}{0}{3}{3/3}{}{0}}}
\@writefile{nav}{\headcommand {\beamer@framepages {3}{3}}}
\transparent@use{.8}
\@writefile{toc}{\beamer@sectionintoc {1}{Sujet}{4}{0}{1}}
\@writefile{nav}{\headcommand {\sectionentry {1}{Sujet}{4}{Sujet}{0}}}
\@writefile{nav}{\headcommand {\beamer@sectionpages {1}{3}}}
\@writefile{nav}{\headcommand {\beamer@subsectionpages {1}{3}}}
\@writefile{nav}{\headcommand {\slideentry {1}{0}{1}{4/4}{}{0}}}
\@writefile{nav}{\headcommand {\beamer@framepages {4}{4}}}
\transparent@use{.8}
\@writefile{toc}{\beamer@sectionintoc {2}{Beacons}{5}{0}{2}}
\@writefile{nav}{\headcommand {\sectionentry {2}{Beacons}{5}{Beacons}{0}}}
\@writefile{nav}{\headcommand {\beamer@sectionpages {4}{4}}}
\@writefile{nav}{\headcommand {\beamer@subsectionpages {4}{4}}}
\@writefile{toc}{\beamer@subsectionintoc {2}{1}{G\'en\'eralit\'es}{5}{0}{2}}
\@writefile{nav}{\headcommand {\beamer@subsectionentry {0}{2}{1}{5}{G\'en\'eralit\'es}}\headcommand {\beamer@subsectionpages {5}{4}}}
\@writefile{nav}{\headcommand {\slideentry {2}{1}{1}{5/5}{G\'en\'eralit\'es}{0}}}
\@writefile{nav}{\headcommand {\beamer@framepages {5}{5}}}
\transparent@use{.8}
\@writefile{toc}{\beamer@subsectionintoc {2}{2}{iBeacon}{6}{0}{2}}
\@writefile{nav}{\headcommand {\beamer@subsectionentry {0}{2}{2}{6}{iBeacon}}\headcommand {\beamer@subsectionpages {5}{5}}}
\@writefile{nav}{\headcommand {\slideentry {2}{2}{1}{6/6}{iBeacon}{0}}}
\@writefile{nav}{\headcommand {\beamer@framepages {6}{6}}}
\transparent@use{.8}
\@writefile{toc}{\beamer@subsectionintoc {2}{3}{Utilisation sous iOS}{7}{0}{2}}
\@writefile{nav}{\headcommand {\beamer@subsectionentry {0}{2}{3}{7}{Utilisation sous iOS}}\headcommand {\beamer@subsectionpages {6}{6}}}
\@writefile{nav}{\headcommand {\slideentry {2}{3}{1}{7/7}{Utilisation sous iOS}{0}}}
\@writefile{nav}{\headcommand {\beamer@framepages {7}{7}}}
\transparent@use{.8}
\@writefile{toc}{\beamer@sectionintoc {3}{Architecture}{8}{0}{3}}
\@writefile{nav}{\headcommand {\sectionentry {3}{Architecture}{8}{Architecture}{0}}}
\@writefile{nav}{\headcommand {\beamer@sectionpages {5}{7}}}
\@writefile{nav}{\headcommand {\beamer@subsectionpages {7}{7}}}
\@writefile{nav}{\headcommand {\slideentry {3}{0}{1}{8/8}{}{0}}}
\@writefile{nav}{\headcommand {\beamer@framepages {8}{8}}}
\transparent@use{.8}
\@writefile{toc}{\beamer@sectionintoc {4}{Back-end}{9}{0}{4}}
\@writefile{nav}{\headcommand {\sectionentry {4}{Back-end}{9}{Back-end}{0}}}
\@writefile{nav}{\headcommand {\beamer@sectionpages {8}{8}}}
\@writefile{nav}{\headcommand {\beamer@subsectionpages {8}{8}}}
\@writefile{nav}{\headcommand {\slideentry {4}{0}{1}{9/9}{}{0}}}
\@writefile{nav}{\headcommand {\beamer@framepages {9}{9}}}
\transparent@use{.8}
\@writefile{toc}{\beamer@sectionintoc {5}{Front-end}{10}{0}{5}}
\@writefile{nav}{\headcommand {\sectionentry {5}{Front-end}{10}{Front-end}{0}}}
\@writefile{nav}{\headcommand {\beamer@sectionpages {9}{9}}}
\@writefile{nav}{\headcommand {\beamer@subsectionpages {9}{9}}}
\@writefile{toc}{\beamer@subsectionintoc {5}{1}{Structure du programme}{10}{0}{5}}
\@writefile{nav}{\headcommand {\beamer@subsectionentry {0}{5}{1}{10}{Structure du programme}}\headcommand {\beamer@subsectionpages {10}{9}}}
\@writefile{nav}{\headcommand {\slideentry {5}{1}{1}{10/10}{Structure du programme}{0}}}
\@writefile{nav}{\headcommand {\beamer@framepages {10}{10}}}
\transparent@use{.8}
\@writefile{toc}{\beamer@subsectionintoc {5}{2}{Interface \& D\'emonstration}{11}{0}{5}}
\@writefile{nav}{\headcommand {\beamer@subsectionentry {0}{5}{2}{11}{Interface \& D\'emonstration}}\headcommand {\beamer@subsectionpages {10}{10}}}
\@writefile{nav}{\headcommand {\slideentry {5}{2}{1}{11/11}{Interface \& D\'emonstration}{0}}}
\@writefile{nav}{\headcommand {\beamer@framepages {11}{11}}}
\transparent@use{.8}
\@writefile{toc}{\beamer@sectionintoc {6}{Conclusion}{12}{0}{6}}
\@writefile{nav}{\headcommand {\sectionentry {6}{Conclusion}{12}{Conclusion}{0}}}
\@writefile{nav}{\headcommand {\beamer@sectionpages {10}{11}}}
\@writefile{nav}{\headcommand {\beamer@subsectionpages {11}{11}}}
\@writefile{nav}{\headcommand {\slideentry {6}{0}{1}{12/12}{}{0}}}
\@writefile{nav}{\headcommand {\beamer@framepages {12}{12}}}
\transparent@use{.8}
\@writefile{toc}{\beamer@sectionintoc {7}{Questions}{13}{0}{7}}
\@writefile{nav}{\headcommand {\sectionentry {7}{Questions}{13}{Questions}{0}}}
\@writefile{nav}{\headcommand {\beamer@sectionpages {12}{12}}}
\@writefile{nav}{\headcommand {\beamer@subsectionpages {12}{12}}}
\@writefile{nav}{\headcommand {\slideentry {7}{0}{1}{13/13}{}{0}}}
\@writefile{nav}{\headcommand {\beamer@framepages {13}{13}}}
\@writefile{nav}{\headcommand {\beamer@partpages {1}{13}}}
\@writefile{nav}{\headcommand {\beamer@subsectionpages {13}{13}}}
\@writefile{nav}{\headcommand {\beamer@sectionpages {13}{13}}}
\@writefile{nav}{\headcommand {\beamer@documentpages {13}}}
\@writefile{nav}{\headcommand {\def \inserttotalframenumber {13}}}
