\BOOKMARK [2][]{Outline0.1}{Sujet}{}% 1
\BOOKMARK [2][]{Outline0.2}{Beacons}{}% 2
\BOOKMARK [3][]{Outline0.2.1.5}{G\351n\351ralit\351s}{Outline0.2}% 3
\BOOKMARK [3][]{Outline0.2.2.6}{iBeacon}{Outline0.2}% 4
\BOOKMARK [3][]{Outline0.2.3.7}{Utilisation sous iOS}{Outline0.2}% 5
\BOOKMARK [2][]{Outline0.3}{Architecture}{}% 6
\BOOKMARK [2][]{Outline0.4}{Back-end}{}% 7
\BOOKMARK [2][]{Outline0.5}{Front-end}{}% 8
\BOOKMARK [3][]{Outline0.5.1.10}{Structure du programme}{Outline0.5}% 9
\BOOKMARK [3][]{Outline0.5.2.11}{Interface \046 D\351monstration}{Outline0.5}% 10
\BOOKMARK [2][]{Outline0.6}{Conclusion}{}% 11
\BOOKMARK [2][]{Outline0.7}{Questions}{}% 12
