STUDENT_TERM_CODE	STUDENT_PIDM	STUDENT_CRN	STUDENT_REG_SEQ	STUDENT_RSTS_CODE	STUDENT_ADD_DATE	STUDENT_ACTIVITY_DATE	STUDENT_LEVL_CODE	STUDENT_CAMP_CODE
201710	123456	66151	11	RW	21-Apr-16	21-Apr-16	UG	M
201710	234567	66151	11	RW	21-Apr-16	21-Apr-16	UG	M
201710	987654	50289	11	RW	3-Jun-16	3-Jun-16	UG	O
201710	123456	50289	12	RW	4-Jun-16	4-Jun-16	UG	O
201715	123456	40148	6	RW	14-Jun-16	14-Jun-16	UG	H
201715	234567	40148	7	RW	15-Jun-16	15-Jun-16	UG	H
201710	583106	66151	11	RW	21-Apr-16	21-Apr-16	UG	M
201810	876253	66151	11	RW	21-Apr-17	21-Apr-17	UG	M