PIDM	TERM_CODE_EFF	STST_CODE	STYP_CODE	MAJR_CODE_1	MAJR_CODE_2	ACTIVITY_DATE	MAJR_CODE_1_2	MAJR_CODE_2_2	PROGRAM_1	PROGRAM_2	COLL_CODE_1	COLL_CODE_2
123456	201710	AS	C	RCPR		17-Mar-16			BS NURSING	M ED	AS	RC
234567	201710	AS	D	FAJA	FA86	19-May-16			AB MUS	AB THE	IS	
583106	201710	AS	N	EAGV	EASL	12-Apr-16			M ED		RC	
987654	201710	AS	D	AS47		12-Jul-16			AB		CC	EA
990041	201710	AS	C			17-Mar-16			NON-DEGREE		AS	
990042	201710	AS	C	AS47		17-Mar-16			AS APL SC		AS	
990043	201710	AS	C	EAPK		17-Mar-16			AS APL SC E1		AS	
876253	201810	AS	C	RCPR		17-Mar-76			BS NURSING	M ED	AS	RC