{
  "crossListedCourseSections": [
    {
      "crn": "71427",
      "sectionName": "ACC 668 B",
      "sectionCode": "B",
      "courseSubjectCode": "ACC",
      "courseNumber": "668",
      "courseSectionGuid": "2bf6ded8-be1a-3327-1026-f65fafd37ad5"
    }
  ]
}