uid	banner_id	pidm	staff	student
doej	+00123456	123456	N	Y
smithd	+09876543	987654	N	Y
jonesl	+00567890	567890	Y	N
howardt	+00234567	234567	Y	Y
franklr	+00876543	876543	Y	N
johnsob	+01238765	1238765	N	N
souther	+00876253	876253	N	Y