PIDM	ADD_DATE	REVIEW_DATE	REVIEW_STATUS	TYPE
1238765	10-Jan-14		requested	student
987654	10-Jan-15		requested	student
876253	10-Jan-13	sysdate-150	cancelled	student
876253	10-Jan-14	sysdate-200	complete	student
876253	10-Jan-15		requested	student
234567	10-Jan-15	sysdate-2	complete	student
