uid	banner_id	pidm
doej	+00123456	123456
smithd	+09876543	987654
jonesl	+00567890	567890
howardt	+00234567	234567
franklr	+00876543	876543
johnsob	+01238765	1238765
souther	+00876253	876253
tststd01	+09900000	990000
tststd02	+09900001	990001
tststd03	+09900002	990002
tststd04	+09900003	990003
tststd05	+09900004	990004
tststd06	+09900005	990005
tststd07	+09900006	990006
tststd08	+09900007	990007
tststd09	+09900008	990008
tststd10	+09900009	990009
tststd11	+09900010	990010
tststd12	+09900011	990011
tststd13	+09900012	990012
tststd14	+09900013	990013
tststd15	+09900014	990014
tststd16	+09900015	990015
tststd17	+09900016	990016
tststd18	+09900017	990017
tststd19	+09900018	990018
tststd20	+09900019	990019
tststd21	+09900020	990020
tststd22	+09900021	990021
tststd23	+09900022	990022
tststd24	+09900023	990023
tststd25	+09900024	990024
tststd26	+09900025	990025
tststd27	+09900026	990026
tststd28	+09900027	990027
tststd29	+09900028	990028
tststd30	+09900029	990029
tststd31	+09900030	990030
tststd32	+09900031	990031
tststd33	+09900032	990032
tststd34	+09900033	990033
tststd35	+09900034	990034
tststd36	+09900035	990035
tststd37	+09900036	990036
tststd38	+09900037	990037
tststd39	+09900038	990038
tststd40	+09900039	990039
tststd41	+09900040	990040
tststd42	+09900041	990041