{
  "name": "duitlinux-oswatcher",
  "version": "0.2.2",
  "author": "Chris Edester",
  "summary": "Install and set up Oracle oswatcher",
  "license": "Apache-2.0",
  "source": "https://git.itapps.miamioh.edu/duit-linux/puppet-oswatcher.git",
  "project_page": "https://git.itapps.miamioh.edu/duit-linux/puppet-oswatcher",
  "issues_url": "https://git.itapps.miamioh.edu/duit-linux/puppet-oswatcher/issues",
  "dependencies": [
    {
      "name": "puppetlabs/stdlib",
      "version_requirement": ">= 4.2.0 < 7.0.0"
    }
  ],
  "operatingsystem_support": [
    {
      "operatingsystem": "RedHat",
      "operatingsystemrelease": [
        "5",
        "6",
        "7"
      ]
    },
    {
      "operatingsystem": "CentOS",
      "operatingsystemrelease": [
        "5",
        "6",
        "7"
      ]
    },
    {
      "operatingsystem": "OracleLinux",
      "operatingsystemrelease": [
        "5",
        "6",
        "7"
      ]
    }
  ],
  "requirements": [
    {
      "name": "puppet",
      "version_requirement": ">= 5.0.0 < 7.0.0"
    }
  ],
  "tags": [
    "oracle",
    "oswatcher"
  ],
  "pdk-version": "1.18.1",
  "template-url": "pdk-default#1.18.1",
  "template-ref": "tags/1.18.1-0-g3d2e75c"
}
