{
  "name": "duitlinux-nagiosxi",
  "version": "1.0.5",
  "author": "Chris Edester",
  "summary": "Install and set up nagiosxi using the source tar.gz",
  "license": "Apache-2.0",
  "source": "https://git.itapps.miamioh.edu/duit-linux/puppet-nagiosxi.git",
  "project_page": "https://git.itapps.miamioh.edu/duit-linux/puppet-nagiosxi",
  "issues_url": "https://git.itapps.miamioh.edu/duit-linux/puppet-nagiosxi/issues",
  "dependencies": [
    {
      "name": "puppetlabs/stdlib",
      "version_requirement": ">= 4.2.0 < 9.0.0"
    },
    {
      "name": "puppetlabs/inifile",
      "version_requirement": ">= 1.3.0 < 6.0.0"
    },
    {
      "name": "puppet/archive",
      "version_requirement": ">= 4.6.0 < 7.0.0"
    },
    {
      "name": "puppetlabs/apache",
      "version_requirement": ">= 1.4.0 < 13.0.0"
    }
  ],
  "operatingsystem_support": [
    {
      "operatingsystem": "RedHat",
      "operatingsystemrelease": [
        "6",
        "7"
      ]
    },
    {
      "operatingsystem": "CentOS",
      "operatingsystemrelease": [
        "6",
        "7"
      ]
    },
    {
      "operatingsystem": "OracleLinux",
      "operatingsystemrelease": [
        "6",
        "7"
      ]
    }
  ],
  "requirements": [
    {
      "name": "puppet",
      "version_requirement": ">= 6.0.0 < 8.0.0"
    }
  ],
  "tags": [
    "nagios",
    "nagiosxi",
    "gearman"
  ],
  "pdk-version": "2.4.0",
  "template-url": "https://github.com/puppetlabs/pdk-templates#2.4.0",
  "template-ref": "tags/2.4.0-0-gfa6b6d2"
}
