
<svg width="192" height="192" xmlns="http://www.w3.org/2000/svg">
<style>
    .value {
        font: 300 16px sans-serif;
        text-align: center;
        dominant-baseline: middle;
        text-anchor: middle;
    }
    .node {
        fill: lightgray;
        stroke-width: 1;
    }
</style>
<g stroke="#000000">
<line x1="137.0" y1="96" x2="161.0" y2="144"/>
<line x1="137.0" y1="96" x2="113.0" y2="144"/>
<line x1="41.0" y1="96" x2="65.0" y2="144"/>
<line x1="41.0" y1="96" x2="17.0" y2="144"/>
<line x1="89.0" y1="48" x2="137.0" y2="96"/>
<line x1="89.0" y1="48" x2="41.0" y2="96"/>
<circle class="node" cx="89.0" cy="48" r="16"/>
<text class="value" x="89.0" y="48">9</text>
<circle class="node" cx="41.0" cy="96" r="16"/>
<text class="value" x="41.0" y="96">5</text>
<circle class="node" cx="137.0" cy="96" r="16"/>
<text class="value" x="137.0" y="96">12</text>
<circle class="node" cx="17.0" cy="144" r="16"/>
<text class="value" x="17.0" y="144">3</text>
<circle class="node" cx="65.0" cy="144" r="16"/>
<text class="value" x="65.0" y="144">6</text>
<circle class="node" cx="113.0" cy="144" r="16"/>
<text class="value" x="113.0" y="144">10</text>
<circle class="node" cx="161.0" cy="144" r="16"/>
<text class="value" x="161.0" y="144">14</text>
</g>
</svg>
