﻿[
  {
    "outputFile": "Client/Dist/Css/PanleLayout.css",
    "inputFile": "Client/Src/Scss/Views/Shared/PanleLayout.scss"
  },
  {
    "outputFile": "Client/Dist/Css/Views/Shared/components/WizardHelper.css",
    "inputFile": "Client/Src/Scss/Views/Shared/components/WizardHelper.scss"
  },
  {
    "outputFile": "Views/MachineStop/Css/Index.css",
    "inputFile": "Views/MachineStop/Css/Index.scss"
  },
  {
    "outputFile": "Views/QualitiveEvaluation/Css/Index.css",
    "inputFile": "Views/QualitiveEvaluation/Css/Index.scss"
  },
  {
    "outputFile": "Views/QuantitiveEvaluation/Css/Index.css",
    "inputFile": "Views/QuantitiveEvaluation/Css/Index.scss"
  },
  {
    "outputFile": "Views/ProductionStatistics/Css/Index.css",
    "inputFile": "Views/ProductionStatistics/Css/Index.scss"
  }
]