{
  "gateway": {
    "path": "CompanionGateway/Companion-Gateway-Bootloader-Package-V1.0.8",
    "version": "1.0.8",
    "sha1":"3b62aa60756c5f81842c69df08563e7411560097"
  },
  "companion": {
    "path": "CompanionLoad/Nordic/Companion-Bootloader-Package-V0.2.14.zip",
    "version": "0.2.14",
    "sha1":"051302b611950a382a29114eceb36ff67023b454"
  }
}