\relax 
\providecommand\hyper@newdestlabel[2]{}
\providecommand\HyperFirstAtBeginDocument{\AtBeginDocument}
\HyperFirstAtBeginDocument{\ifx\hyper@anchor\@undefined
\global\let\oldcontentsline\contentsline
\gdef\contentsline#1#2#3#4{\oldcontentsline{#1}{#2}{#3}}
\global\let\oldnewlabel\newlabel
\gdef\newlabel#1#2{\newlabelxx{#1}#2}
\gdef\newlabelxx#1#2#3#4#5#6{\oldnewlabel{#1}{{#2}{#3}}}
\AtEndDocument{\ifx\hyper@anchor\@undefined
\let\contentsline\oldcontentsline
\let\newlabel\oldnewlabel
\fi}
\fi}
\global\let\hyper@last\relax 
\gdef\HyperFirstAtBeginDocument#1{#1}
\providecommand\HyField@AuxAddToFields[1]{}
\providecommand\HyField@AuxAddToCoFields[2]{}
\select@language{french}
\@writefile{toc}{\select@language{french}}
\@writefile{lof}{\select@language{french}}
\@writefile{lot}{\select@language{french}}
\@writefile{toc}{\contentsline {paragraph}{Introduction}{2}{section*.2}}
\@writefile{toc}{\contentsline {section}{\numberline {I}Organisation générale}{2}{section.0.1}}
\@writefile{toc}{\contentsline {subsection}{\numberline {I.1}Une organisation en Units}{2}{subsection.0.1.1}}
\@writefile{toc}{\contentsline {subsection}{\numberline {I.2}Types et variables}{2}{subsection.0.1.2}}
\@writefile{toc}{\contentsline {section}{\numberline {II}Les Units}{5}{section.0.2}}
\@writefile{toc}{\contentsline {subsection}{\numberline {II.1}Qwirkle}{5}{subsection.0.2.1}}
\@writefile{toc}{\contentsline {subsection}{\numberline {II.2}UMain}{5}{subsection.0.2.2}}
\@writefile{toc}{\contentsline {subsection}{\numberline {II.3}Utils}{5}{subsection.0.2.3}}
\@writefile{toc}{\contentsline {subsection}{\numberline {II.4}UPlayer}{5}{subsection.0.2.4}}
\@writefile{toc}{\contentsline {subsection}{\numberline {II.5}UHuman}{5}{subsection.0.2.5}}
\@writefile{toc}{\contentsline {subsection}{\numberline {II.6}UComputer}{5}{subsection.0.2.6}}
\@writefile{toc}{\contentsline {subsection}{\numberline {II.7}UMap}{5}{subsection.0.2.7}}
\@writefile{toc}{\contentsline {section}{\numberline {III}L'interface graphique}{6}{section.0.3}}
\bibcite{germinal1885}{1}
\bibcite{ellana06}{2}
\bibcite{tobie06}{3}
\bibcite{nahash17}{4}
\bibcite{nuitdestemps68}{5}
\newlabel{LastPage}{{}{7}{}{page.7}{}}
\xdef\lastpage@lastpage{7}
\xdef\lastpage@lastpageHy{7}
