0000 2800         mov r0,#60
     003C
0002 2900         mov r1,#13
     000D
0004 5004 @boucle cmp r0,r1
0005 7800         blt fin
     000A
0007 4004         sub r0,r0,r1
0008 8800         b boucle
     0004
000A 8800 @fin    b fin
     000A
