0000 2800      mov r0,#6
     0006
0002 2900      mov r1,#4
     0004
0004 3EC0      add r6,r6,#1
     0001
0006 10C0      str r0,[r6]
0007 2020      mov r0,r1
0008 01C0      ldr r1,[r6]
0009 4EC0      sub r6,r6,#1
     0001
000B 8800 @fin b fin
     000B
