0000 2800        mov r0,#6
     0006
0002 5800        cmp r0,#1
     0001
0004 7800        blt fin
     0033
0006 6800        beq fin
     0033
0008 3EC0 @vrai  add r6,r6,#1
     0001
000A 10C4        str r1,[r6]
000B 2900        mov r1,#1
     0001
000D 3EC0        add r6,r6,#1
     0001
000F 10C8        str r2,[r6]
0010 2A00        mov r2,#1
     0001
0012 3EC0        add r6,r6,#1
     0001
0014 10CC        str r3,[r6]
0015 2B00        mov r3,#2
     0002
0017 3EC0        add r6,r6,#1
     0001
0019 10D0        str r4,[r6]
001A 500C @while cmp r0,r3
001B 7800        blt end
     0026
001D 6800        beq end
     0026
001F 2420        mov r4,r1
0020 3128        add r1,r1,r2
0021 2280        mov r2,r4
0022 3B60        add r3,r3,#1
     0001
0024 8800        b while
     001A
0026 2020 @end   mov r0,r1
0027 04C0        ldr r4,[r6]
0028 4EC0        sub r6,r6,#1
     0001
002A 03C0        ldr r3,[r6]
002B 4EC0        sub r6,r6,#1
     0001
002D 02C0        ldr r2,[r6]
002E 4EC0        sub r6,r6,#1
     0001
0030 01C0        ldr r1,[r6]
0031 4EC0        sub r6,r6,#1
     0001
0033 8800 @fin   b fin
     0033
