v2.0 raw
2E00 004A 2800 0004 2F00 000B 3EC0 0001
10DC 8800 000D 8800 000B 5800 0000 6800
002A 5800 0001 6800 002C 3EC0 0001 10C0
4800 0001 2F00 0021 3EC0 0001 10DC 8800
0011 01C0 4EC0 0001 8800 0030 07C0 4EC0
0001 801C 2800 0001 07C0 4EC0 0001 801C
3EC0 0001 10C4 3EC0 0001 10C8 2200 5820
0001 6800 0040 3008 4920 0001 8800 0037
02C0 4EC0 0001 01C0 4EC0 0001 07C0 4EC0
0001 801C 0000