0000 2900            mov r1,#0
     0000
0002 2A00            mov r2,#2
     0002
0004 5028            cmp r1,r2
0005 6800            beq egaux
     000B
0007 7800            blt inferieur
     000D
0009 8800 @superieur b superieur
     0009
000B 8800 @egaux     b egaux
     000B
000D 8800 @inferieur b inferieur
     000D
