0000 2800         mov r0,#5
     0005
0002 2900         mov r1,#5
     0005
0004 5004         cmp r0,r1
0005 6800         beq equal
     000B
0007 2A00 @neq    mov r2,#0
     0000
0009 8800 @finneq b finneq
     0009
000B 2A00 @equal  mov r2,#1
     0001
000D 8800 @fineq  b fineq
     000D
