0000 2800            mov r0,#5
     0005
0002 2900            mov r1,#2
     0002
0004 5004            cmp r0,r1
0005 7800            blt inferieur
     000B
0007 2A00 @superieur mov r2,#0
     0000
0009 8800            b fin
     000D
000B 2A00 @inferieur mov r2,#1
     0001
000D 8800 @fin       b fin
     000D
