module gitlab.com/MaxIV/kubernetes/mortalgpu

go 1.23.6

require (
	atomicgo.dev/cursor v0.2.0
	github.com/NVIDIA/go-nvml v0.12.4-1
	github.com/fsnotify/fsnotify v1.8.0
	github.com/go-logr/logr v1.4.2
	github.com/jedib0t/go-pretty/v6 v6.6.6
	github.com/markbates/pkger v0.17.1
	github.com/prometheus/client_golang v1.20.5
	github.com/prometheus/procfs v0.15.1
	github.com/shirou/gopsutil/v3 v3.24.5
	github.com/spf13/cobra v1.9.1
	github.com/spf13/viper v1.19.0
	github.com/stretchr/testify v1.10.0
	go.uber.org/zap v1.27.0
	golang.org/x/exp v0.0.0-20250215185904-eff6e970281f
	google.golang.org/grpc v1.70.0
	google.golang.org/protobuf v1.36.5
	k8s.io/api v0.32.2
	k8s.io/apimachinery v0.32.2
	k8s.io/client-go v0.32.2
	k8s.io/kubelet v0.32.2
	sigs.k8s.io/controller-runtime v0.20.2
)

require (
	github.com/beorn7/perks v1.0.1 // indirect
	github.com/cespare/xxhash/v2 v2.3.0 // indirect
	github.com/davecgh/go-spew v1.1.2-0.20180830191138-d8f796af33cc // indirect
	github.com/emicklei/go-restful/v3 v3.12.1 // indirect
	github.com/evanphx/json-patch/v5 v5.9.11 // indirect
	github.com/fxamacker/cbor/v2 v2.7.0 // indirect
	github.com/go-ole/go-ole v1.3.0 // indirect
	github.com/go-openapi/jsonpointer v0.21.0 // indirect
	github.com/go-openapi/jsonreference v0.21.0 // indirect
	github.com/go-openapi/swag v0.23.0 // indirect
	github.com/gobuffalo/here v0.6.7 // indirect
	github.com/gogo/protobuf v1.3.2 // indirect
	github.com/golang/protobuf v1.5.4 // indirect
	github.com/google/gnostic-models v0.6.9 // indirect
	github.com/google/go-cmp v0.6.0 // indirect
	github.com/google/gofuzz v1.2.0 // indirect
	github.com/google/uuid v1.6.0 // indirect
	github.com/hashicorp/hcl v1.0.0 // indirect
	github.com/inconshreveable/mousetrap v1.1.0 // indirect
	github.com/josharian/intern v1.0.0 // indirect
	github.com/json-iterator/go v1.1.12 // indirect
	github.com/klauspost/compress v1.17.11 // indirect
	github.com/lufia/plan9stats v0.0.0-20240909124753-873cd0166683 // indirect
	github.com/magiconair/properties v1.8.9 // indirect
	github.com/mailru/easyjson v0.9.0 // indirect
	github.com/mattn/go-runewidth v0.0.16 // indirect
	github.com/mitchellh/mapstructure v1.5.0 // indirect
	github.com/modern-go/concurrent v0.0.0-20180306012644-bacd9c7ef1dd // indirect
	github.com/modern-go/reflect2 v1.0.2 // indirect
	github.com/munnerz/goautoneg v0.0.0-20191010083416-a7dc8b61c822 // indirect
	github.com/pelletier/go-toml/v2 v2.2.3 // indirect
	github.com/pkg/errors v0.9.1 // indirect
	github.com/pmezard/go-difflib v1.0.1-0.20181226105442-5d4384ee4fb2 // indirect
	github.com/power-devops/perfstat v0.0.0-20240221224432-82ca36839d55 // indirect
	github.com/prometheus/client_model v0.6.1 // indirect
	github.com/prometheus/common v0.62.0 // indirect
	github.com/rivo/uniseg v0.4.7 // indirect
	github.com/sagikazarmark/locafero v0.7.0 // indirect
	github.com/sagikazarmark/slog-shim v0.1.0 // indirect
	github.com/shoenig/go-m1cpu v0.1.6 // indirect
	github.com/sourcegraph/conc v0.3.0 // indirect
	github.com/spf13/afero v1.12.0 // indirect
	github.com/spf13/cast v1.7.1 // indirect
	github.com/spf13/pflag v1.0.6 // indirect
	github.com/subosito/gotenv v1.6.0 // indirect
	github.com/tklauser/go-sysconf v0.3.14 // indirect
	github.com/tklauser/numcpus v0.9.0 // indirect
	github.com/x448/float16 v0.8.4 // indirect
	github.com/yusufpapurcu/wmi v1.2.4 // indirect
	go.uber.org/multierr v1.11.0 // indirect
	golang.org/x/net v0.35.0 // indirect
	golang.org/x/oauth2 v0.26.0 // indirect
	golang.org/x/sys v0.30.0 // indirect
	golang.org/x/term v0.29.0 // indirect
	golang.org/x/text v0.22.0 // indirect
	golang.org/x/time v0.10.0 // indirect
	google.golang.org/genproto/googleapis/rpc v0.0.0-20250212204824-5a70512c5d8b // indirect
	gopkg.in/evanphx/json-patch.v4 v4.12.0 // indirect
	gopkg.in/inf.v0 v0.9.1 // indirect
	gopkg.in/ini.v1 v1.67.0 // indirect
	gopkg.in/yaml.v3 v3.0.1 // indirect
	k8s.io/klog/v2 v2.130.1 // indirect
	k8s.io/kube-openapi v0.0.0-20241212222426-2c72e554b1e7 // indirect
	k8s.io/utils v0.0.0-20241210054802-24370beab758 // indirect
	sigs.k8s.io/json v0.0.0-20241014173422-cfa47c3a1cc8 // indirect
	sigs.k8s.io/structured-merge-diff/v4 v4.5.0 // indirect
	sigs.k8s.io/yaml v1.4.0 // indirect
)

// A workaround because the module was renamed.
replace github.com/imdario/mergo v1.0.0 => dario.cat/mergo v1.0.0

replace github.com/imdario/mergo v1.0.1 => dario.cat/mergo v1.0.1
