<?xml version="1.0" encoding="UTF-8" standalone="no"?>
<!-- Created with Inkscape (http://www.inkscape.org/) -->

<svg
   width="63.373344mm"
   height="31.205462mm"
   viewBox="0 0 63.373344 31.205462"
   version="1.1"
   id="svg48984"
   inkscape:version="1.1.2 (0a00cf5339, 2022-02-04)"
   sodipodi:docname="piedeck.svg"
   inkscape:export-filename="/tmp/piedeck.png"
   inkscape:export-xdpi="599.88879"
   inkscape:export-ydpi="599.88879"
   xmlns:inkscape="http://www.inkscape.org/namespaces/inkscape"
   xmlns:sodipodi="http://sodipodi.sourceforge.net/DTD/sodipodi-0.dtd"
   xmlns:xlink="http://www.w3.org/1999/xlink"
   xmlns="http://www.w3.org/2000/svg"
   xmlns:svg="http://www.w3.org/2000/svg">
  <sodipodi:namedview
     id="namedview48986"
     pagecolor="#ffffff"
     bordercolor="#666666"
     borderopacity="1.0"
     inkscape:pageshadow="2"
     inkscape:pageopacity="0.0"
     inkscape:pagecheckerboard="0"
     inkscape:document-units="mm"
     showgrid="false"
     inkscape:object-paths="false"
     inkscape:zoom="3.1037318"
     inkscape:cx="185.09976"
     inkscape:cy="117.60037"
     inkscape:window-width="1704"
     inkscape:window-height="1421"
     inkscape:window-x="2560"
     inkscape:window-y="17"
     inkscape:window-maximized="1"
     inkscape:current-layer="layer1"
     inkscape:snap-midpoints="false"
     inkscape:snap-smooth-nodes="true" />
  <defs
     id="defs48981">
    <pattern
       inkscape:collect="always"
       xlink:href="#pattern16086"
       id="pattern16222"
       patternTransform="matrix(0.09918512,0,0,0.09918513,126.62917,55.103524)" />
    <pattern
       patternUnits="userSpaceOnUse"
       width="39.886292"
       height="49.96594"
       patternTransform="translate(271.99494,286.49055)"
       id="pattern16086">
      <path
         style="fill:none;stroke:#326de6;stroke-width:1.00157;stroke-linecap:butt;stroke-linejoin:miter;stroke-miterlimit:4;stroke-dasharray:none;stroke-opacity:1"
         d="M 0.50078737,0 V 49.96594"
         id="path15236" />
      <path
         style="fill:none;stroke:#326de6;stroke-width:1.00157;stroke-linecap:butt;stroke-linejoin:miter;stroke-miterlimit:4;stroke-dasharray:none;stroke-opacity:1"
         d="M 20.193543,0 V 12.491486 24.982968 37.474454 49.96594"
         id="path15236-9"
         sodipodi:nodetypes="ccccc" />
      <path
         style="fill:none;stroke:#326de6;stroke-width:1.00157;stroke-linecap:butt;stroke-linejoin:miter;stroke-miterlimit:4;stroke-dasharray:none;stroke-opacity:1"
         d="M 0.50078737,24.982972 H 20.193536"
         id="path15729" />
      <path
         style="fill:none;stroke:#326de6;stroke-width:1.00157;stroke-linecap:butt;stroke-linejoin:miter;stroke-miterlimit:4;stroke-dasharray:none;stroke-opacity:1"
         d="M 20.193543,12.491486 H 39.886292"
         id="path15729-6" />
      <path
         style="fill:none;stroke:#326de6;stroke-width:1.00157;stroke-linecap:butt;stroke-linejoin:miter;stroke-miterlimit:4;stroke-dasharray:none;stroke-opacity:1"
         d="M 20.193543,37.474454 H 39.886292"
         id="path15729-6-0" />
    </pattern>
    <pattern
       inkscape:collect="always"
       xlink:href="#pattern16086-6"
       id="pattern16222-2"
       patternTransform="matrix(0.09918512,0,0,0.09918513,126.8155,62.338887)" />
    <pattern
       patternUnits="userSpaceOnUse"
       width="39.886292"
       height="49.96594"
       patternTransform="translate(271.99494,286.49055)"
       id="pattern16086-6">
      <path
         style="fill:none;stroke:#326de6;stroke-width:1.00157;stroke-linecap:butt;stroke-linejoin:miter;stroke-miterlimit:4;stroke-dasharray:none;stroke-opacity:1"
         d="M 0.50078737,0 V 49.96594"
         id="path15236-1" />
      <path
         style="fill:none;stroke:#326de6;stroke-width:1.00157;stroke-linecap:butt;stroke-linejoin:miter;stroke-miterlimit:4;stroke-dasharray:none;stroke-opacity:1"
         d="M 20.193543,0 V 12.491486 24.982968 37.474454 49.96594"
         id="path15236-9-8"
         sodipodi:nodetypes="ccccc" />
      <path
         style="fill:none;stroke:#326de6;stroke-width:1.00157;stroke-linecap:butt;stroke-linejoin:miter;stroke-miterlimit:4;stroke-dasharray:none;stroke-opacity:1"
         d="M 0.50078737,24.982972 H 20.193536"
         id="path15729-7" />
      <path
         style="fill:none;stroke:#326de6;stroke-width:1.00157;stroke-linecap:butt;stroke-linejoin:miter;stroke-miterlimit:4;stroke-dasharray:none;stroke-opacity:1"
         d="M 20.193543,12.491486 H 39.886292"
         id="path15729-6-9" />
      <path
         style="fill:none;stroke:#326de6;stroke-width:1.00157;stroke-linecap:butt;stroke-linejoin:miter;stroke-miterlimit:4;stroke-dasharray:none;stroke-opacity:1"
         d="M 20.193543,37.474454 H 39.886292"
         id="path15729-6-0-2" />
    </pattern>
    <pattern
       inkscape:collect="always"
       xlink:href="#pattern16086-6-3"
       id="pattern16222-2-2"
       patternTransform="matrix(0.09918512,0,0,0.09918513,126.97753,69.574168)" />
    <pattern
       patternUnits="userSpaceOnUse"
       width="39.886292"
       height="49.96594"
       patternTransform="translate(271.99494,286.49055)"
       id="pattern16086-6-3">
      <path
         style="fill:none;stroke:#326de6;stroke-width:1.00157;stroke-linecap:butt;stroke-linejoin:miter;stroke-miterlimit:4;stroke-dasharray:none;stroke-opacity:1"
         d="M 0.50078737,0 V 49.96594"
         id="path15236-1-7" />
      <path
         style="fill:none;stroke:#326de6;stroke-width:1.00157;stroke-linecap:butt;stroke-linejoin:miter;stroke-miterlimit:4;stroke-dasharray:none;stroke-opacity:1"
         d="M 20.193543,0 V 12.491486 24.982968 37.474454 49.96594"
         id="path15236-9-8-5"
         sodipodi:nodetypes="ccccc" />
      <path
         style="fill:none;stroke:#326de6;stroke-width:1.00157;stroke-linecap:butt;stroke-linejoin:miter;stroke-miterlimit:4;stroke-dasharray:none;stroke-opacity:1"
         d="M 0.50078737,24.982972 H 20.193536"
         id="path15729-7-9" />
      <path
         style="fill:none;stroke:#326de6;stroke-width:1.00157;stroke-linecap:butt;stroke-linejoin:miter;stroke-miterlimit:4;stroke-dasharray:none;stroke-opacity:1"
         d="M 20.193543,12.491486 H 39.886292"
         id="path15729-6-9-2" />
      <path
         style="fill:none;stroke:#326de6;stroke-width:1.00157;stroke-linecap:butt;stroke-linejoin:miter;stroke-miterlimit:4;stroke-dasharray:none;stroke-opacity:1"
         d="M 20.193543,37.474454 H 39.886292"
         id="path15729-6-0-2-2" />
    </pattern>
  </defs>
  <g
     inkscape:label="Layer 1"
     inkscape:groupmode="layer"
     id="layer1"
     transform="translate(-77.186427,-37.491976)">
    <path
       style="fill:#326de6;fill-opacity:1;stroke:none;stroke-width:0.264583px;stroke-linecap:butt;stroke-linejoin:miter;stroke-opacity:1"
       d="m 78.839912,59.250198 4.9193,-3.94912 24.983238,-2.15651 25.18597,2.08265 6.42314,4.75353 -31.35322,-1.48539 10.44392,4.28306 -24.108938,0.0388 -16.49341,-3.56707"
       id="path36285-3-7"
       sodipodi:nodetypes="ccccccccc" />
    <path
       id="path5780-3-5-26-6-68"
       style="fill:#ffffff;fill-opacity:1;stroke:#000000;stroke-width:0.265;stroke-linecap:butt;stroke-linejoin:round;stroke-miterlimit:4;stroke-dasharray:none;stroke-opacity:1"
       inkscape:transform-center-x="11.488844"
       inkscape:transform-center-y="0.13944188"
       d="m 133.90412,54.177728 v 1.04939 m -25.18597,-3.13204 v 1.04939 m -24.983238,1.10713 v 1.04938 m -5.967624,3.72239 1.04832,0.22673 4.919304,-3.94912 24.983238,-2.15651 25.18597,2.08265 6.42315,4.75358 v -1.04943 l -6.42315,-4.75354 -25.18597,-2.08265 -24.983238,2.15652 z" />
    <path
       style="fill:none;stroke:#000000;stroke-width:0.264583px;stroke-linecap:butt;stroke-linejoin:miter;stroke-opacity:1"
       d="m 140.32727,59.980648 v 5.64797"
       id="path35581-6-92" />
    <path
       style="fill:#84a7f0;fill-opacity:1;stroke:none;stroke-width:0.264583px;stroke-linecap:butt;stroke-linejoin:round;stroke-opacity:1"
       d="m 108.97404,58.495258 10.44392,4.28306 0.9705,0.002 v 1.87921 l 19.93881,0.96914 v -5.64797 z"
       id="path35763-6"
       sodipodi:nodetypes="ccccccc" />
    <path
       style="fill:#ffffff;fill-opacity:1;stroke:#000000;stroke-width:0.264583px;stroke-linecap:butt;stroke-linejoin:bevel;stroke-opacity:1"
       d="m 77.767288,59.023368 1.04832,0.22673 16.493414,3.56707 0.16203,5.64777 -17.541734,-3.79379 z"
       id="path4084-0-4-64"
       sodipodi:nodetypes="cccccc" />
    <g
       id="g69196-4-9"
       inkscape:export-filename="/tmp/kubepie.png"
       inkscape:export-xdpi="600.07507"
       inkscape:export-ydpi="600.07507"
       style="stroke:#326de6;stroke-width:0.529167;stroke-miterlimit:4;stroke-dasharray:none;stroke-dashoffset:0;stroke-opacity:1"
       transform="translate(34.635521,-27.490052)">
      <path
         style="fill:none;stroke:#326de6;stroke-width:0.529167;stroke-linecap:round;stroke-linejoin:miter;stroke-miterlimit:4;stroke-dasharray:none;stroke-dashoffset:0;stroke-opacity:1"
         d="m 47.55293,90.285754 4.385433,0.948449 4.385433,0.94845"
         id="path68683-9-5"
         sodipodi:nodetypes="ccc" />
      <path
         style="fill:none;stroke:#326de6;stroke-width:0.529167;stroke-linecap:round;stroke-linejoin:miter;stroke-miterlimit:4;stroke-dasharray:none;stroke-dashoffset:0;stroke-opacity:1"
         d="m 47.55293,89.33549 4.385433,0.948449 4.385433,0.94845"
         id="path68683-7-2-04"
         sodipodi:nodetypes="ccc" />
      <path
         style="fill:none;stroke:#326de6;stroke-width:0.529167;stroke-linecap:round;stroke-linejoin:miter;stroke-miterlimit:4;stroke-dasharray:none;stroke-dashoffset:0;stroke-opacity:1"
         d="m 47.55293,91.299378 4.385433,0.948449 4.385433,0.94845"
         id="path68683-7-9-0-8"
         sodipodi:nodetypes="ccc" />
    </g>
    <path
       style="fill:#ffffff;fill-opacity:1;stroke:#000000;stroke-width:0.265;stroke-linecap:round;stroke-linejoin:round;stroke-miterlimit:4;stroke-dasharray:none;stroke-opacity:1"
       d="m 95.333282,62.817218 25.055178,-0.0369 0.0243,5.64367 -24.917408,0.041 -0.16203,-5.64777"
       id="path41599-7" />
    <path
       style="fill:#326de6;fill-opacity:1;stroke:none;stroke-width:0.264583px;stroke-linecap:butt;stroke-linejoin:miter;stroke-opacity:1"
       d="m 78.677882,52.014917 4.9193,-3.94912 24.983238,-2.15651 25.18597,2.08265 6.42314,4.75353 -31.35322,-1.48539 10.44392,4.28306 -24.108938,0.0388 -16.49341,-3.56707"
       id="path36285-3-7-5"
       sodipodi:nodetypes="ccccccccc" />
    <path
       id="path5780-3-5-26-6-68-6"
       style="fill:#ffffff;fill-opacity:1;stroke:#000000;stroke-width:0.265;stroke-linecap:butt;stroke-linejoin:round;stroke-miterlimit:4;stroke-dasharray:none;stroke-opacity:1"
       inkscape:transform-center-x="11.488844"
       inkscape:transform-center-y="0.13944188"
       d="m 133.74209,46.942447 v 1.04939 m -25.18597,-3.13204 v 1.04939 m -24.983238,1.10713 v 1.04938 m -5.967624,3.72239 1.04832,0.22673 4.919304,-3.94912 24.983238,-2.15651 25.18597,2.08265 6.42315,4.75358 v -1.04943 l -6.42315,-4.75354 -25.18597,-2.08265 -24.983238,2.15652 z" />
    <path
       style="fill:none;stroke:#000000;stroke-width:0.264583px;stroke-linecap:butt;stroke-linejoin:miter;stroke-opacity:1"
       d="m 140.16524,52.745367 v 5.64797"
       id="path35581-6-92-1" />
    <path
       style="fill:#84a7f0;fill-opacity:1;stroke:none;stroke-width:0.264583px;stroke-linecap:butt;stroke-linejoin:round;stroke-opacity:1"
       d="m 108.81201,51.259977 10.44392,4.28306 0.9705,0.002 v 1.87921 l 19.93881,0.96914 v -5.64797 z"
       id="path35763-6-1"
       sodipodi:nodetypes="ccccccc" />
    <path
       style="fill:#ffffff;fill-opacity:1;stroke:#000000;stroke-width:0.264583px;stroke-linecap:butt;stroke-linejoin:bevel;stroke-opacity:1"
       d="m 77.605258,51.788087 1.04832,0.22673 16.493414,3.56707 0.16203,5.64777 -17.541734,-3.79379 z"
       id="path4084-0-4-64-5"
       sodipodi:nodetypes="cccccc" />
    <g
       id="g69196-4-9-9"
       inkscape:export-filename="/tmp/kubepie.png"
       inkscape:export-xdpi="600.07507"
       inkscape:export-ydpi="600.07507"
       style="stroke:#326de6;stroke-width:0.529167;stroke-miterlimit:4;stroke-dasharray:none;stroke-dashoffset:0;stroke-opacity:1"
       transform="translate(34.473491,-34.725333)">
      <path
         style="fill:none;stroke:#326de6;stroke-width:0.529167;stroke-linecap:round;stroke-linejoin:miter;stroke-miterlimit:4;stroke-dasharray:none;stroke-dashoffset:0;stroke-opacity:1"
         d="m 47.55293,90.285754 4.385433,0.948449 4.385433,0.94845"
         id="path68683-9-5-8"
         sodipodi:nodetypes="ccc" />
      <path
         style="fill:none;stroke:#326de6;stroke-width:0.529167;stroke-linecap:round;stroke-linejoin:miter;stroke-miterlimit:4;stroke-dasharray:none;stroke-dashoffset:0;stroke-opacity:1"
         d="m 47.55293,89.33549 4.385433,0.948449 4.385433,0.94845"
         id="path68683-7-2-04-4"
         sodipodi:nodetypes="ccc" />
      <path
         style="fill:none;stroke:#326de6;stroke-width:0.529167;stroke-linecap:round;stroke-linejoin:miter;stroke-miterlimit:4;stroke-dasharray:none;stroke-dashoffset:0;stroke-opacity:1"
         d="m 47.55293,91.299378 4.385433,0.948449 4.385433,0.94845"
         id="path68683-7-9-0-8-8"
         sodipodi:nodetypes="ccc" />
    </g>
    <path
       style="fill:url(#pattern16222-2-2);fill-opacity:1;stroke:#000000;stroke-width:0.264583px;stroke-linecap:butt;stroke-linejoin:round;stroke-opacity:1"
       d="m 108.97404,58.495258 10.44392,4.28306 0.9705,0.002 v 1.87921 l 19.93881,0.96914 v -5.64797 z"
       id="path35763-6-1-4-6-0-8"
       sodipodi:nodetypes="ccccccc" />
    <path
       style="fill:#ffffff;fill-opacity:1;stroke:#000000;stroke-width:0.265;stroke-linecap:round;stroke-linejoin:round;stroke-miterlimit:4;stroke-dasharray:none;stroke-opacity:1"
       d="m 95.171252,55.581937 25.055178,-0.0369 0.0243,5.64367 -24.917408,0.041 -0.16203,-5.64777"
       id="path41599-7-1" />
    <path
       style="fill:#326de6;fill-opacity:1;stroke:none;stroke-width:0.264583px;stroke-linecap:butt;stroke-linejoin:miter;stroke-opacity:1"
       d="m 78.491552,44.779596 4.9193,-3.94912 24.983238,-2.15651 25.18597,2.08265 6.42314,4.75353 -31.35322,-1.48539 10.44392,4.28306 -24.108938,0.0388 -16.49341,-3.56707"
       id="path36285-3-7-5-3"
       sodipodi:nodetypes="ccccccccc" />
    <path
       id="path5780-3-5-26-6-68-6-0"
       style="fill:#ffffff;fill-opacity:1;stroke:#000000;stroke-width:0.265;stroke-linecap:butt;stroke-linejoin:round;stroke-miterlimit:4;stroke-dasharray:none;stroke-opacity:1"
       inkscape:transform-center-x="11.488844"
       inkscape:transform-center-y="0.13944188"
       d="m 133.55576,39.707126 v 1.04939 m -25.18597,-3.13204 v 1.04939 m -24.983238,1.10713 v 1.04938 m -5.967624,3.72239 1.04832,0.22673 4.919304,-3.94912 24.983238,-2.15651 25.18597,2.08265 6.42315,4.75358 v -1.04943 l -6.42315,-4.75354 -25.18597,-2.08265 -24.983238,2.15652 z" />
    <path
       style="fill:none;stroke:#000000;stroke-width:0.264583px;stroke-linecap:butt;stroke-linejoin:miter;stroke-opacity:1"
       d="m 139.97891,45.510046 v 5.64797"
       id="path35581-6-92-1-4" />
    <path
       style="fill:#84a7f0;fill-opacity:1;stroke:none;stroke-width:0.264583px;stroke-linecap:butt;stroke-linejoin:round;stroke-opacity:1"
       d="m 108.62568,44.024606 10.44392,4.28306 0.9705,0.002 v 1.87921 l 19.93881,0.96914 v -5.64797 z"
       id="path35763-6-1-4"
       sodipodi:nodetypes="ccccccc" />
    <path
       style="fill:url(#pattern16222);fill-opacity:1;stroke:#000000;stroke-width:0.264583px;stroke-linecap:butt;stroke-linejoin:round;stroke-opacity:1"
       d="m 108.62568,44.024606 10.44392,4.28306 0.9705,0.002 v 1.87921 l 19.93881,0.96914 v -5.64797 z"
       id="path35763-6-1-4-6"
       sodipodi:nodetypes="ccccccc" />
    <path
       style="fill:url(#pattern16222-2);fill-opacity:1;stroke:#000000;stroke-width:0.264583px;stroke-linecap:butt;stroke-linejoin:round;stroke-opacity:1"
       d="m 108.81201,51.259977 10.44392,4.28306 0.9705,0.002 v 1.87921 l 19.93881,0.96914 v -5.64797 z"
       id="path35763-6-1-4-6-0"
       sodipodi:nodetypes="ccccccc" />
    <path
       style="fill:#ffffff;fill-opacity:1;stroke:#000000;stroke-width:0.264583px;stroke-linecap:butt;stroke-linejoin:bevel;stroke-opacity:1"
       d="m 77.418928,44.552766 1.04832,0.22673 16.493414,3.56707 0.16203,5.64777 -17.541734,-3.79379 z"
       id="path4084-0-4-64-5-4"
       sodipodi:nodetypes="cccccc" />
    <g
       id="g69196-4-9-9-4"
       inkscape:export-filename="/tmp/kubepie.png"
       inkscape:export-xdpi="600.07507"
       inkscape:export-ydpi="600.07507"
       style="stroke:#326de6;stroke-width:0.529167;stroke-miterlimit:4;stroke-dasharray:none;stroke-dashoffset:0;stroke-opacity:1"
       transform="translate(34.287161,-41.960654)">
      <path
         style="fill:none;stroke:#326de6;stroke-width:0.529167;stroke-linecap:round;stroke-linejoin:miter;stroke-miterlimit:4;stroke-dasharray:none;stroke-dashoffset:0;stroke-opacity:1"
         d="m 47.55293,90.285754 4.385433,0.948449 4.385433,0.94845"
         id="path68683-9-5-8-7"
         sodipodi:nodetypes="ccc" />
      <path
         style="fill:none;stroke:#326de6;stroke-width:0.529167;stroke-linecap:round;stroke-linejoin:miter;stroke-miterlimit:4;stroke-dasharray:none;stroke-dashoffset:0;stroke-opacity:1"
         d="m 47.55293,89.33549 4.385433,0.948449 4.385433,0.94845"
         id="path68683-7-2-04-4-6"
         sodipodi:nodetypes="ccc" />
      <path
         style="fill:none;stroke:#326de6;stroke-width:0.529167;stroke-linecap:round;stroke-linejoin:miter;stroke-miterlimit:4;stroke-dasharray:none;stroke-dashoffset:0;stroke-opacity:1"
         d="m 47.55293,91.299378 4.385433,0.948449 4.385433,0.94845"
         id="path68683-7-9-0-8-8-3"
         sodipodi:nodetypes="ccc" />
    </g>
    <path
       style="fill:#ffffff;fill-opacity:1;stroke:#000000;stroke-width:0.265;stroke-linecap:round;stroke-linejoin:round;stroke-miterlimit:4;stroke-dasharray:none;stroke-opacity:1"
       d="m 94.984922,48.346616 25.055178,-0.0369 0.0243,5.64367 -24.917408,0.041 -0.16203,-5.64777"
       id="path41599-7-1-1" />
    <text
       xml:space="preserve"
       style="font-size:3.52777px;line-height:1.25;font-family:Ubuntu;-inkscape-font-specification:Ubuntu;word-spacing:0.264583px;stroke-width:0.264583"
       x="100.31595"
       y="60.166836"
       id="text59039"
       transform="rotate(-0.35438557)"><tspan
         sodipodi:role="line"
         id="tspan59037"
         style="font-style:normal;font-variant:normal;font-weight:bold;font-stretch:normal;font-family:Ubuntu;-inkscape-font-specification:'Ubuntu Bold';stroke-width:0.264583"
         x="100.31595"
         y="60.166836">PieDeck</tspan></text>
    <path
       style="fill:none;stroke:#000000;stroke-width:0.465;stroke-linecap:round;stroke-linejoin:miter;stroke-miterlimit:4;stroke-dasharray:none;stroke-opacity:1"
       d="m 77.418927,44.552766 0.510391,20.118382"
       id="path74282" />
    <path
       style="fill:none;stroke:#000000;stroke-width:0.465;stroke-linecap:round;stroke-linejoin:miter;stroke-miterlimit:4;stroke-dasharray:none;stroke-opacity:1"
       d="m 94.98496,48.346616 0.48609,20.118321"
       id="path74284" />
    <path
       style="fill:none;stroke:#000000;stroke-width:0.465;stroke-linecap:round;stroke-linejoin:round;stroke-miterlimit:4;stroke-dasharray:none;stroke-opacity:1;paint-order:markers fill stroke"
       d="m 120.0401,48.309716 0.37266,20.114272"
       id="path74286" />
    <path
       style="fill:none;stroke:#000000;stroke-width:0.465;stroke-linecap:round;stroke-linejoin:round;stroke-miterlimit:4;stroke-dasharray:none;stroke-opacity:1"
       d="m 139.97891,44.460665 0.34836,21.168002"
       id="path84880" />
  </g>
</svg>
