<?xml version="1.0" encoding="UTF-8" standalone="no"?>
<!-- Created with Inkscape (http://www.inkscape.org/) -->

<svg
   width="62.825001mm"
   height="16.634901mm"
   viewBox="0 0 62.825001 16.634901"
   version="1.1"
   id="svg42690"
   inkscape:version="1.1.2 (0a00cf5339, 2022-02-04)"
   sodipodi:docname="piepass.svg"
   inkscape:export-filename="/tmp/piepass.png"
   inkscape:export-xdpi="600.18378"
   inkscape:export-ydpi="600.18378"
   xmlns:inkscape="http://www.inkscape.org/namespaces/inkscape"
   xmlns:sodipodi="http://sodipodi.sourceforge.net/DTD/sodipodi-0.dtd"
   xmlns:xlink="http://www.w3.org/1999/xlink"
   xmlns="http://www.w3.org/2000/svg"
   xmlns:svg="http://www.w3.org/2000/svg">
  <sodipodi:namedview
     id="namedview42692"
     pagecolor="#ffffff"
     bordercolor="#666666"
     borderopacity="1.0"
     inkscape:pageshadow="2"
     inkscape:pageopacity="0.0"
     inkscape:pagecheckerboard="0"
     inkscape:document-units="mm"
     showgrid="false"
     inkscape:zoom="6.2074636"
     inkscape:cx="116.87543"
     inkscape:cy="70.721317"
     inkscape:window-width="1704"
     inkscape:window-height="1421"
     inkscape:window-x="2560"
     inkscape:window-y="17"
     inkscape:window-maximized="1"
     inkscape:current-layer="layer1"
     inkscape:object-paths="true" />
  <defs
     id="defs42687">
    <pattern
       inkscape:collect="always"
       xlink:href="#pattern3380"
       id="pattern4869"
       patternTransform="matrix(0.17948896,-4.8952516e-4,4.8953506e-4,0.17948895,93.973162,44.982582)" />
    <pattern
       patternUnits="userSpaceOnUse"
       width="53.793322"
       height="33.947311"
       patternTransform="translate(215.22274,168.64868)"
       id="pattern3380">
      <path
         id="path2699-3-6-7"
         style="fill:none;stroke:#fea901;stroke-width:1.01669;stroke-linecap:butt;stroke-linejoin:miter;stroke-miterlimit:4;stroke-dasharray:none;stroke-opacity:1"
         d="M 40.813131,2.8369562 46.491425,20.065539 M 39.456175,3.2841877 45.134465,20.512771 M 8.9484256,13.339099 14.584964,30.581444 M 7.2606398,13.89537 12.938934,31.123953 M 0.64192359,16.076804 47.473108,0.64192375 48.89268,4.9490696 c 0,0 -3.591968,1.2681108 -2.183463,5.5416834 1.260079,3.823215 5.02261,3.072608 5.02261,3.072608 l 1.419572,4.307146 -46.831185,15.43488 -1.4195717,-4.307146 c 0,0 3.5590866,-1.161664 2.1361399,-5.479056 C 5.7519847,19.620973 2.0614952,20.38395 2.0614952,20.38395 Z"
         sodipodi:nodetypes="cccccccccccsccccscc" />
    </pattern>
  </defs>
  <g
     inkscape:label="Layer 1"
     inkscape:groupmode="layer"
     id="layer1"
     transform="translate(-48.462658,-19.378901)">
    <path
       style="fill:#fea901;fill-opacity:1;stroke:none;stroke-width:0.264583px;stroke-linecap:butt;stroke-linejoin:miter;stroke-opacity:1"
       d="m 49.643461,26.666418 4.919302,-3.949119 24.983253,-2.156509 25.185984,2.08265 6.42316,4.753527 -31.353254,-1.485389 10.443925,4.283059 -24.108952,0.0388 -16.493418,-3.567069"
       id="path36285"
       sodipodi:nodetypes="ccccccccc" />
    <path
       id="path5780-3-5-26-6"
       style="fill:#ffffff;fill-opacity:1;stroke:#000000;stroke-width:0.265;stroke-linecap:butt;stroke-linejoin:round;stroke-miterlimit:4;stroke-dasharray:none;stroke-opacity:1"
       inkscape:transform-center-x="11.488847"
       inkscape:transform-center-y="0.13944151"
       d="m 104.732,21.59405 v 1.04939 M 79.546017,19.511401 v 1.049389 m -24.983253,1.10713 v 1.049379 m -5.967623,3.722389 1.04832,0.226729 4.919302,-3.949118 24.983254,-2.156509 25.185983,2.08265 6.42316,4.753578 v -1.04943 L 104.732,21.59405 79.546017,19.511401 54.562763,21.66792 Z" />
    <path
       style="fill:none;stroke:#000000;stroke-width:0.264583px;stroke-linecap:butt;stroke-linejoin:miter;stroke-opacity:1"
       d="m 111.15516,27.396967 v 5.647968"
       id="path35581-6" />
    <path
       style="fill:#fecb66;fill-opacity:1;stroke:none;stroke-width:0.264583px;stroke-linecap:butt;stroke-linejoin:round;stroke-opacity:1"
       d="m 79.801906,25.911578 10.443925,4.283059 0.970502,0.002 v 1.879209 l 19.938827,0.969139 v -5.647968 z"
       id="path35763"
       sodipodi:nodetypes="ccccccc" />
    <path
       style="fill:url(#pattern4869);fill-opacity:1;stroke:#000000;stroke-width:0.264583px;stroke-linecap:butt;stroke-linejoin:round;stroke-opacity:1"
       d="m 79.8019,25.911578 10.44393,4.283059 0.9705,0.002 v 1.879209 l 19.93883,0.969139 v -5.647968 z"
       id="path35763-5"
       sodipodi:nodetypes="ccccccc" />
    <path
       style="fill:#ffffff;fill-opacity:1;stroke:#000000;stroke-width:0.264583px;stroke-linecap:butt;stroke-linejoin:bevel;stroke-opacity:1"
       d="m 48.595141,26.439688 1.04832,0.22673 16.493418,3.567068 0.162031,5.647768 -17.541739,-3.793789 z"
       id="path4084-0-4"
       sodipodi:nodetypes="cccccc" />
    <g
       id="g69196-4"
       inkscape:export-filename="/tmp/kubepie.png"
       inkscape:export-xdpi="600.07507"
       inkscape:export-ydpi="600.07507"
       style="stroke:#fea901;stroke-width:0.529167;stroke-miterlimit:4;stroke-dasharray:none;stroke-dashoffset:0;stroke-opacity:1"
       transform="translate(5.4633518,-60.073696)">
      <path
         style="fill:none;stroke:#fea901;stroke-width:0.529167;stroke-linecap:round;stroke-linejoin:miter;stroke-miterlimit:4;stroke-dasharray:none;stroke-dashoffset:0;stroke-opacity:1"
         d="m 47.55293,90.285754 4.385433,0.948449 4.385433,0.94845"
         id="path68683-9"
         sodipodi:nodetypes="ccc" />
      <path
         style="fill:none;stroke:#fea901;stroke-width:0.529167;stroke-linecap:round;stroke-linejoin:miter;stroke-miterlimit:4;stroke-dasharray:none;stroke-dashoffset:0;stroke-opacity:1"
         d="m 47.55293,89.33549 4.385433,0.948449 4.385433,0.94845"
         id="path68683-7-2"
         sodipodi:nodetypes="ccc" />
      <path
         style="fill:none;stroke:#fea901;stroke-width:0.529167;stroke-linecap:round;stroke-linejoin:miter;stroke-miterlimit:4;stroke-dasharray:none;stroke-dashoffset:0;stroke-opacity:1"
         d="m 47.55293,91.299378 4.385433,0.948449 4.385433,0.94845"
         id="path68683-7-9-0"
         sodipodi:nodetypes="ccc" />
    </g>
    <path
       style="fill:#ffffff;fill-opacity:1;stroke:#000000;stroke-width:0.265;stroke-linecap:round;stroke-linejoin:round;stroke-miterlimit:4;stroke-dasharray:none;stroke-opacity:1"
       d="m 66.161139,30.233536 25.055194,-0.0369 0.0243,5.643667 -24.917424,0.041 -0.16203,-5.647768"
       id="path41599" />
    <text
       xml:space="preserve"
       style="font-style:normal;font-variant:normal;font-weight:bold;font-stretch:normal;font-size:3.52777px;line-height:1.25;font-family:Ubuntu;-inkscape-font-specification:'Ubuntu Bold';stroke-width:0.264583"
       x="73.051422"
       y="34.312511"
       id="text63402-3"
       inkscape:export-filename="/tmp/kubepie.png"
       inkscape:export-xdpi="600.07507"
       inkscape:export-ydpi="600.07507"><tspan
         sodipodi:role="line"
         id="tspan63400-1"
         style="font-style:normal;font-variant:normal;font-weight:bold;font-stretch:normal;font-family:Ubuntu;-inkscape-font-specification:'Ubuntu Bold';stroke-width:0.264583"
         x="73.051422"
         y="34.312511">PiePass</tspan></text>
  </g>
</svg>
