module gitlab.maxiv.lu.se/kits-maxiv/svc-maxiv-mascot-registry

go 1.12

require (
	github.com/golang/protobuf v1.2.0
	golang.org/x/net v0.0.0-20190311183353-d8887717615a
	google.golang.org/grpc v1.21.1
)
