-------------------------------------------------------------------------------
Test set: fr.umfds.genielogiciel.TP3.TestRemboursement
-------------------------------------------------------------------------------
Tests run: 3, Failures: 0, Errors: 0, Skipped: 0, Time elapsed: 0 sec - in fr.umfds.genielogiciel.TP3.TestRemboursement
