/home/e20180002752/eclipse-workspace/TP1/src/main/java/tp1/Hongrois.java
/home/e20180002752/eclipse-workspace/TP1/src/main/java/tp1/AjoutVoeuImpossible.java
/home/e20180002752/eclipse-workspace/TP1/src/main/java/fr/umfds/genielogiciel/TP1/App.java
/home/e20180002752/eclipse-workspace/TP1/src/main/java/tp1/HelloWorldICal4J.java
/home/e20180002752/eclipse-workspace/TP1/src/main/java/tp1/Sujet.java
/home/e20180002752/eclipse-workspace/TP1/src/main/java/tp1/Groupe.java
/home/e20180002752/eclipse-workspace/TP1/src/main/java/tp1/GestionTER.java
