/home/e20180002752/eclipse-workspace/TP1/src/test/java/tp1/TestCohérenceGroupeSujet.java
/home/e20180002752/eclipse-workspace/TP1/src/test/java/fr/umfds/genielogiciel/TP1/AppTest.java
/home/e20180002752/eclipse-workspace/TP1/src/test/java/tp1/TestGroupe.java
