\relax 
\@writefile{toc}{\contentsline {section}{\numberline {1}Aims}{1}{}\protected@file@percent }
\@writefile{toc}{\contentsline {section}{\numberline {2}Deliverables}{2}{}\protected@file@percent }
\@writefile{toc}{\contentsline {section}{\numberline {3}Relevance}{2}{}\protected@file@percent }
\gdef \@abspage@last{2}
