\relax 
\providecommand\hyper@newdestlabel[2]{}
\providecommand\HyperFirstAtBeginDocument{\AtBeginDocument}
\HyperFirstAtBeginDocument{\ifx\hyper@anchor\@undefined
\global\let\oldcontentsline\contentsline
\gdef\contentsline#1#2#3#4{\oldcontentsline{#1}{#2}{#3}}
\global\let\oldnewlabel\newlabel
\gdef\newlabel#1#2{\newlabelxx{#1}#2}
\gdef\newlabelxx#1#2#3#4#5#6{\oldnewlabel{#1}{{#2}{#3}}}
\AtEndDocument{\ifx\hyper@anchor\@undefined
\let\contentsline\oldcontentsline
\let\newlabel\oldnewlabel
\fi}
\fi}
\global\let\hyper@last\relax 
\gdef\HyperFirstAtBeginDocument#1{#1}
\providecommand\HyField@AuxAddToFields[1]{}
\providecommand\HyField@AuxAddToCoFields[2]{}
\@writefile{toc}{\contentsline {section}{\numberline {1}Introduction}{1}{section.1}\protected@file@percent }
\@writefile{toc}{\contentsline {section}{\numberline {2}Research}{2}{section.2}\protected@file@percent }
\@writefile{toc}{\contentsline {subsection}{\numberline {2.1}Message Authentication Code (MAC)}{2}{subsection.2.1}\protected@file@percent }
\@writefile{lof}{\contentsline {figure}{\numberline {1}{\ignorespaces MAC Process Flow\relax }}{2}{figure.caption.6}\protected@file@percent }
\providecommand*\caption@xref[2]{\@setref\relax\@undefined{#1}}
\newlabel{fig:MacFlow}{{1}{2}{MAC Process Flow\relax }{figure.caption.6}{}}
\@writefile{toc}{\contentsline {subsection}{\numberline {2.2}Hash-Based Message Authentication Code (HMAC)}{3}{subsection.2.2}\protected@file@percent }
\@writefile{toc}{\contentsline {subsection}{\numberline {2.3}HMAC Based One-Time Password (HOTP)}{4}{subsection.2.3}\protected@file@percent }
\@writefile{toc}{\contentsline {subsubsection}{\numberline {2.3.1}Dynamic Truncation}{5}{subsubsection.2.3.1}\protected@file@percent }
\@writefile{lol}{\contentsline {listing}{\numberline {1}{\ignorespaces Dynamic Truncation Pseudocode\relax }}{5}{listing.caption.7}\protected@file@percent }
\@writefile{toc}{\contentsline {subsection}{\numberline {2.4}Time-Based One-Time Passwords (TOTP)}{6}{subsection.2.4}\protected@file@percent }
\@writefile{toc}{\contentsline {subsection}{\numberline {2.5}Matrix Barcodes}{6}{subsection.2.5}\protected@file@percent }
\@writefile{lof}{\contentsline {figure}{\numberline {2}{\ignorespaces Matrix Barcode Examples\relax }}{7}{figure.caption.8}\protected@file@percent }
\newlabel{fig:matrixbarcodes}{{2}{7}{Matrix Barcode Examples\relax }{figure.caption.8}{}}
\@writefile{toc}{\contentsline {subsubsection}{\numberline {2.5.1}Quick Response (QR)}{7}{subsubsection.2.5.1}\protected@file@percent }
\@writefile{lot}{\contentsline {table}{\numberline {1}{\ignorespaces QR Code Error Correction Levels\relax }}{7}{table.caption.9}\protected@file@percent }
\newlabel{tab:QRError}{{1}{7}{QR Code Error Correction Levels\relax }{table.caption.9}{}}
\@writefile{lof}{\contentsline {figure}{\numberline {3}{\ignorespaces Version 1 QR Code Components\relax }}{8}{figure.caption.10}\protected@file@percent }
\newlabel{fig:QRBreakdown}{{3}{8}{Version 1 QR Code Components\relax }{figure.caption.10}{}}
\@writefile{toc}{\contentsline {subsubsection}{\numberline {2.5.2}Aztec}{8}{subsubsection.2.5.2}\protected@file@percent }
\@writefile{lof}{\contentsline {figure}{\numberline {4}{\ignorespaces Two Layer, Full-Size Aztec Code Components\relax }}{9}{figure.caption.11}\protected@file@percent }
\newlabel{fig:AztecBreakdown}{{4}{9}{Two Layer, Full-Size Aztec Code Components\relax }{figure.caption.11}{}}
\@writefile{lot}{\contentsline {table}{\numberline {2}{\ignorespaces Aztec Codeword Lengths\relax }}{9}{table.caption.12}\protected@file@percent }
\newlabel{tab:AztecCodewordLengths}{{2}{9}{Aztec Codeword Lengths\relax }{table.caption.12}{}}
\@writefile{toc}{\contentsline {subsubsection}{\numberline {2.5.3}Data Matrix}{10}{subsubsection.2.5.3}\protected@file@percent }
\@writefile{lof}{\contentsline {figure}{\numberline {5}{\ignorespaces Size 12 ECC200 Data Matrix Code Components\relax }}{10}{figure.caption.13}\protected@file@percent }
\newlabel{fig:DataMatrixBreakdown}{{5}{10}{Size 12 ECC200 Data Matrix Code Components\relax }{figure.caption.13}{}}
\@writefile{toc}{\contentsline {subsubsection}{\numberline {2.5.4}PDF417}{10}{subsubsection.2.5.4}\protected@file@percent }
\@writefile{lof}{\contentsline {figure}{\numberline {6}{\ignorespaces PDF417 Example With Three Codewords\relax }}{11}{figure.caption.14}\protected@file@percent }
\newlabel{fig:PDF417Example}{{6}{11}{PDF417 Example With Three Codewords\relax }{figure.caption.14}{}}
\@writefile{lof}{\contentsline {figure}{\numberline {7}{\ignorespaces Boarding Pass With PDQ417 Barcode\relax }}{11}{figure.caption.15}\protected@file@percent }
\newlabel{fig:BoardingPass}{{7}{11}{Boarding Pass With PDQ417 Barcode\relax }{figure.caption.15}{}}
\@writefile{toc}{\contentsline {subsubsection}{\numberline {2.5.5}Images Within Matrix Barcodes}{11}{subsubsection.2.5.5}\protected@file@percent }
\@writefile{lof}{\contentsline {figure}{\numberline {8}{\ignorespaces QR Code With Inset Logo\relax }}{12}{figure.caption.16}\protected@file@percent }
\newlabel{fig:QRWithLogo}{{8}{12}{QR Code With Inset Logo\relax }{figure.caption.16}{}}
\@writefile{toc}{\contentsline {subsubsection}{\numberline {2.5.6}Best Suited Matrix Barcode}{12}{subsubsection.2.5.6}\protected@file@percent }
\@writefile{toc}{\contentsline {subsection}{\numberline {2.6}Software Libraries}{12}{subsection.2.6}\protected@file@percent }
\@writefile{toc}{\contentsline {subsubsection}{\numberline {2.6.1}PiCamera}{13}{subsubsection.2.6.1}\protected@file@percent }
\@writefile{lot}{\contentsline {table}{\numberline {3}{\ignorespaces Pi Camera v1 Module Sensor Modes\relax }}{13}{table.caption.17}\protected@file@percent }
\newlabel{tab:PiCamModes}{{3}{13}{Pi Camera v1 Module Sensor Modes\relax }{table.caption.17}{}}
\@writefile{toc}{\contentsline {subsubsection}{\numberline {2.6.2}Pillow}{13}{subsubsection.2.6.2}\protected@file@percent }
\@writefile{toc}{\contentsline {subsubsection}{\numberline {2.6.3}PyZBar}{14}{subsubsection.2.6.3}\protected@file@percent }
\newlabel{PyZBar}{{2.6.3}{14}{PyZBar}{subsubsection.2.6.3}{}}
\@writefile{toc}{\contentsline {subsection}{\numberline {2.7}Docker and Containerisation}{14}{subsection.2.7}\protected@file@percent }
\@writefile{lof}{\contentsline {figure}{\numberline {9}{\ignorespaces Containerisation vs Virtual Machines\relax }}{15}{figure.caption.18}\protected@file@percent }
\newlabel{ref:ContainerVsVM}{{9}{15}{Containerisation vs Virtual Machines\relax }{figure.caption.18}{}}
\@writefile{toc}{\contentsline {subsection}{\numberline {2.8}Dashboard Frameworks}{16}{subsection.2.8}\protected@file@percent }
\newlabel{dashboards}{{2.8}{16}{Dashboard Frameworks}{subsection.2.8}{}}
\@writefile{toc}{\contentsline {subsubsection}{\numberline {2.8.1}Tipboard}{16}{subsubsection.2.8.1}\protected@file@percent }
\@writefile{toc}{\contentsline {subsubsection}{\numberline {2.8.2}Grafana}{17}{subsubsection.2.8.2}\protected@file@percent }
\@writefile{toc}{\contentsline {subsection}{\numberline {2.9}Database Solutions}{17}{subsection.2.9}\protected@file@percent }
\@writefile{toc}{\contentsline {subsubsection}{\numberline {2.9.1}Relational Vs Non-Relational Database models}{17}{subsubsection.2.9.1}\protected@file@percent }
\@writefile{toc}{\contentsline {subsubsection}{\numberline {2.9.2}Client-Server Vs Embedded Databases}{18}{subsubsection.2.9.2}\protected@file@percent }
\@writefile{lof}{\contentsline {figure}{\numberline {10}{\ignorespaces Client-Server Vs Embedded Database Architecture\relax }}{18}{figure.caption.19}\protected@file@percent }
\newlabel{fig:server-serverless}{{10}{18}{Client-Server Vs Embedded Database Architecture\relax }{figure.caption.19}{}}
\@writefile{toc}{\contentsline {section}{\numberline {3}Requirements}{20}{section.3}\protected@file@percent }
\@writefile{toc}{\contentsline {subsection}{\numberline {3.1}Stakeholders}{20}{subsection.3.1}\protected@file@percent }
\newlabel{sec:stakeholders}{{3.1}{20}{Stakeholders}{subsection.3.1}{}}
\@writefile{toc}{\contentsline {subsection}{\numberline {3.2}Functional Requirements}{21}{subsection.3.2}\protected@file@percent }
\@writefile{toc}{\contentsline {subsubsection}{\numberline {3.2.1}MUST Requirements}{21}{subsubsection.3.2.1}\protected@file@percent }
\@writefile{toc}{\contentsline {subsubsection}{\numberline {3.2.2}SHOULD Requirements}{22}{subsubsection.3.2.2}\protected@file@percent }
\@writefile{toc}{\contentsline {subsubsection}{\numberline {3.2.3}COULD Requirements}{22}{subsubsection.3.2.3}\protected@file@percent }
\@writefile{toc}{\contentsline {subsubsection}{\numberline {3.2.4}WON'T Requirements}{22}{subsubsection.3.2.4}\protected@file@percent }
\@writefile{toc}{\contentsline {subsection}{\numberline {3.3}Non-Functional Requirements}{22}{subsection.3.3}\protected@file@percent }
\@writefile{toc}{\contentsline {section}{\numberline {4}Design}{24}{section.4}\protected@file@percent }
\@writefile{toc}{\contentsline {subsection}{\numberline {4.1}System Overview}{24}{subsection.4.1}\protected@file@percent }
\@writefile{lof}{\contentsline {figure}{\numberline {11}{\ignorespaces Overall System Flow\relax }}{25}{figure.caption.20}\protected@file@percent }
\newlabel{fig:SystemFlow}{{11}{25}{Overall System Flow\relax }{figure.caption.20}{}}
\@writefile{toc}{\contentsline {subsection}{\numberline {4.2}Android Application}{26}{subsection.4.2}\protected@file@percent }
\@writefile{toc}{\contentsline {subsubsection}{\numberline {4.2.1}User Interface}{26}{subsubsection.4.2.1}\protected@file@percent }
\@writefile{lof}{\contentsline {figure}{\numberline {12}{\ignorespaces Main Activity Wireframe Design\relax }}{27}{figure.caption.21}\protected@file@percent }
\newlabel{fig:Wireframe}{{12}{27}{Main Activity Wireframe Design\relax }{figure.caption.21}{}}
\@writefile{lof}{\contentsline {figure}{\numberline {13}{\ignorespaces New Identity Wireframe Design\relax }}{28}{figure.caption.22}\protected@file@percent }
\newlabel{fig:Wireframe2}{{13}{28}{New Identity Wireframe Design\relax }{figure.caption.22}{}}
\@writefile{toc}{\contentsline {subsubsection}{\numberline {4.2.2}Security Considerations}{28}{subsubsection.4.2.2}\protected@file@percent }
\@writefile{toc}{\contentsline {subsubsection}{\numberline {4.2.3}Transferring User Secrets}{29}{subsubsection.4.2.3}\protected@file@percent }
\@writefile{toc}{\contentsline {subsection}{\numberline {4.3}Door Scanner}{30}{subsection.4.3}\protected@file@percent }
\@writefile{lof}{\contentsline {figure}{\numberline {14}{\ignorespaces Raspberry Pi Zero W Case With Camera (Barnes, 2017)\relax }}{30}{figure.caption.23}\protected@file@percent }
\newlabel{fig:piCase}{{14}{30}{Raspberry Pi Zero W Case With Camera (Barnes, 2017)\relax }{figure.caption.23}{}}
\@writefile{lot}{\contentsline {table}{\numberline {4}{\ignorespaces Raspberry Pi Zero W Specifications\relax }}{31}{table.caption.24}\protected@file@percent }
\newlabel{tab:PiSpecs}{{4}{31}{Raspberry Pi Zero W Specifications\relax }{table.caption.24}{}}
\@writefile{lot}{\contentsline {table}{\numberline {5}{\ignorespaces ZeroCam Specifications (OmniVision, 2009)\relax }}{31}{table.caption.25}\protected@file@percent }
\newlabel{tab:PiCamSpecs}{{5}{31}{ZeroCam Specifications (OmniVision, 2009)\relax }{table.caption.25}{}}
\@writefile{toc}{\contentsline {subsubsection}{\numberline {4.3.1}Cost}{32}{subsubsection.4.3.1}\protected@file@percent }
\@writefile{toc}{\contentsline {subsubsection}{\numberline {4.3.2}Flexibility}{32}{subsubsection.4.3.2}\protected@file@percent }
\@writefile{toc}{\contentsline {subsubsection}{\numberline {4.3.3}Form Factor}{33}{subsubsection.4.3.3}\protected@file@percent }
\@writefile{lof}{\contentsline {figure}{\numberline {15}{\ignorespaces Raspberry Pi Zero W Board Layout\relax }}{33}{figure.caption.26}\protected@file@percent }
\newlabel{fig:PiLayout}{{15}{33}{Raspberry Pi Zero W Board Layout\relax }{figure.caption.26}{}}
\@writefile{toc}{\contentsline {subsubsection}{\numberline {4.3.4}Software Compatibility}{33}{subsubsection.4.3.4}\protected@file@percent }
\@writefile{toc}{\contentsline {subsubsection}{\numberline {4.3.5}Library Performance on the Raspberry Pi Zero W}{33}{subsubsection.4.3.5}\protected@file@percent }
\@writefile{lot}{\contentsline {table}{\numberline {6}{\ignorespaces PiCamera Format Capture Speeds in mode 3.\relax }}{34}{table.caption.27}\protected@file@percent }
\newlabel{tab:PiCamFormatSpeeds}{{6}{34}{PiCamera Format Capture Speeds in mode 3.\relax }{table.caption.27}{}}
\@writefile{lot}{\contentsline {table}{\numberline {7}{\ignorespaces PyZBar Decode Speeds\relax }}{34}{table.caption.28}\protected@file@percent }
\newlabel{tab:PiCamModeSpeeds}{{7}{34}{PyZBar Decode Speeds\relax }{table.caption.28}{}}
\@writefile{toc}{\contentsline {subsection}{\numberline {4.4}Back-End}{35}{subsection.4.4}\protected@file@percent }
\@writefile{toc}{\contentsline {subsubsection}{\numberline {4.4.1}API}{35}{subsubsection.4.4.1}\protected@file@percent }
\@writefile{toc}{\contentsline {subsubsection}{\numberline {4.4.2}Web Interface}{36}{subsubsection.4.4.2}\protected@file@percent }
\@writefile{lof}{\contentsline {figure}{\numberline {16}{\ignorespaces Web Dashboard Wireframe\relax }}{37}{figure.caption.29}\protected@file@percent }
\newlabel{fig:DashWireframe}{{16}{37}{Web Dashboard Wireframe\relax }{figure.caption.29}{}}
\@writefile{toc}{\contentsline {subsubsection}{\numberline {4.4.3}Database}{37}{subsubsection.4.4.3}\protected@file@percent }
\@writefile{lof}{\contentsline {figure}{\numberline {17}{\ignorespaces Database Entity Relationship Diagram\relax }}{40}{figure.caption.30}\protected@file@percent }
\newlabel{fig:DB-ERD}{{17}{40}{Database Entity Relationship Diagram\relax }{figure.caption.30}{}}
\@writefile{lof}{\contentsline {figure}{\numberline {18}{\ignorespaces Database Logical Relationship Diagram\relax }}{41}{figure.caption.31}\protected@file@percent }
\newlabel{fig:DB-LRD}{{18}{41}{Database Logical Relationship Diagram\relax }{figure.caption.31}{}}
\@writefile{toc}{\contentsline {section}{\numberline {5}Implementation}{42}{section.5}\protected@file@percent }
\@writefile{toc}{\contentsline {subsection}{\numberline {5.1}Android Application}{42}{subsection.5.1}\protected@file@percent }
\@writefile{toc}{\contentsline {subsection}{\numberline {5.2}Door Scanner}{43}{subsection.5.2}\protected@file@percent }
\@writefile{toc}{\contentsline {subsubsection}{\numberline {5.2.1}Software}{44}{subsubsection.5.2.1}\protected@file@percent }
\@writefile{lol}{\contentsline {listing}{\numberline {2}{\ignorespaces Door Scanner Loop Pseudocode\relax }}{44}{listing.caption.32}\protected@file@percent }
\@writefile{toc}{\contentsline {subsubsection}{\numberline {5.2.2}Hardware}{46}{subsubsection.5.2.2}\protected@file@percent }
\@writefile{lof}{\contentsline {figure}{\numberline {19}{\ignorespaces Raspberry Pi Zero W GPIO Schematic (Thornton, 2015)\relax }}{47}{figure.caption.33}\protected@file@percent }
\newlabel{fig:piGPIO}{{19}{47}{Raspberry Pi Zero W GPIO Schematic (Thornton, 2015)\relax }{figure.caption.33}{}}
\@writefile{lof}{\contentsline {figure}{\numberline {20}{\ignorespaces Door Scanner Wiring Diagram\relax }}{48}{figure.caption.34}\protected@file@percent }
\newlabel{fig:pihardware}{{20}{48}{Door Scanner Wiring Diagram\relax }{figure.caption.34}{}}
\@writefile{lof}{\contentsline {figure}{\numberline {21}{\ignorespaces Door Scanner Scale Model\relax }}{49}{figure.caption.35}\protected@file@percent }
\newlabel{fig:door}{{21}{49}{Door Scanner Scale Model\relax }{figure.caption.35}{}}
\@writefile{toc}{\contentsline {subsection}{\numberline {5.3}Back-End}{50}{subsection.5.3}\protected@file@percent }
\@writefile{lol}{\contentsline {listing}{\numberline {3}{\ignorespaces docker-compose.yml File\relax }}{51}{listing.caption.36}\protected@file@percent }
\newlabel{lst:compose.yml}{{3}{51}{docker-compose.yml File\relax }{listing.caption.36}{}}
\@writefile{lol}{\contentsline {listing}{\numberline {4}{\ignorespaces api.Dockerfile File\relax }}{52}{listing.caption.37}\protected@file@percent }
\newlabel{lst:dockerfile}{{4}{52}{api.Dockerfile File\relax }{listing.caption.37}{}}
\@writefile{toc}{\contentsline {subsubsection}{\numberline {5.3.1}API}{53}{subsubsection.5.3.1}\protected@file@percent }
\@writefile{lol}{\contentsline {listing}{\numberline {5}{\ignorespaces apiZones API Resource Class\relax }}{53}{listing.caption.38}\protected@file@percent }
\newlabel{lst:apiZones}{{5}{53}{apiZones API Resource Class\relax }{listing.caption.38}{}}
\@writefile{toc}{\contentsline {subsubsection}{\numberline {5.3.2}Web Interface}{54}{subsubsection.5.3.2}\protected@file@percent }
\@writefile{lol}{\contentsline {listing}{\numberline {6}{\ignorespaces addFormData Javascript Function\relax }}{55}{listing.caption.39}\protected@file@percent }
\newlabel{lst:addFormData}{{6}{55}{addFormData Javascript Function\relax }{listing.caption.39}{}}
\@writefile{toc}{\contentsline {subsubsection}{\numberline {5.3.3}Database}{55}{subsubsection.5.3.3}\protected@file@percent }
\@writefile{lol}{\contentsline {listing}{\numberline {7}{\ignorespaces Select Formatted Log Information Query\relax }}{56}{listing.caption.40}\protected@file@percent }
\newlabel{lst:getLog}{{7}{56}{Select Formatted Log Information Query\relax }{listing.caption.40}{}}
\@writefile{lol}{\contentsline {listing}{\numberline {8}{\ignorespaces Database Initialisation Script\relax }}{57}{listing.caption.41}\protected@file@percent }
\newlabel{lst:dbinit}{{8}{57}{Database Initialisation Script\relax }{listing.caption.41}{}}
\@writefile{toc}{\contentsline {section}{\numberline {6}Conclusion}{60}{section.6}\protected@file@percent }
\@writefile{toc}{\contentsline {section}{\numberline {7}Glossary}{63}{section.7}\protected@file@percent }
\@writefile{toc}{\contentsline {paragraph}{Activity}{63}{section*.42}\protected@file@percent }
\@writefile{toc}{\contentsline {paragraph}{API}{63}{section*.43}\protected@file@percent }
\@writefile{toc}{\contentsline {paragraph}{CORS}{63}{section*.44}\protected@file@percent }
\@writefile{toc}{\contentsline {paragraph}{DBMS}{63}{section*.45}\protected@file@percent }
\@writefile{toc}{\contentsline {paragraph}{ERD}{63}{section*.46}\protected@file@percent }
\@writefile{toc}{\contentsline {paragraph}{Fail-Safe}{63}{section*.47}\protected@file@percent }
\@writefile{toc}{\contentsline {paragraph}{Fail-Secure}{63}{section*.48}\protected@file@percent }
\@writefile{toc}{\contentsline {paragraph}{FoV}{63}{section*.49}\protected@file@percent }
\@writefile{toc}{\contentsline {paragraph}{GPIO}{63}{section*.50}\protected@file@percent }
\@writefile{toc}{\contentsline {paragraph}{IDE}{63}{section*.51}\protected@file@percent }
\@writefile{toc}{\contentsline {paragraph}{LRD}{63}{section*.52}\protected@file@percent }
\@writefile{toc}{\contentsline {paragraph}{PCB}{63}{section*.53}\protected@file@percent }
\@writefile{toc}{\contentsline {paragraph}{Pseudocode}{63}{section*.54}\protected@file@percent }
\@writefile{toc}{\contentsline {paragraph}{PWA}{63}{section*.55}\protected@file@percent }
\@writefile{toc}{\contentsline {paragraph}{REST}{63}{section*.56}\protected@file@percent }
\@writefile{toc}{\contentsline {paragraph}{RFID}{63}{section*.57}\protected@file@percent }
\@writefile{toc}{\contentsline {paragraph}{SHA}{63}{section*.58}\protected@file@percent }
\@writefile{toc}{\contentsline {paragraph}{SSL}{64}{section*.59}\protected@file@percent }
\@writefile{toc}{\contentsline {paragraph}{TLS}{64}{section*.60}\protected@file@percent }
\@writefile{toc}{\contentsline {paragraph}{UI}{64}{section*.61}\protected@file@percent }
\@writefile{toc}{\contentsline {paragraph}{URI}{64}{section*.62}\protected@file@percent }
\@writefile{toc}{\contentsline {paragraph}{USB OTG}{64}{section*.63}\protected@file@percent }
\@writefile{toc}{\contentsline {paragraph}{VM}{64}{section*.64}\protected@file@percent }
\@writefile{toc}{\contentsline {paragraph}{WSGI}{64}{section*.65}\protected@file@percent }
\@writefile{toc}{\contentsline {section}{\numberline {8}Bibliography}{65}{section.8}\protected@file@percent }
\@writefile{toc}{\contentsline {section}{\numberline {9}Appendices}{71}{section.9}\protected@file@percent }
\@writefile{toc}{\contentsline {subsection}{\numberline {9.1}Source Code}{71}{subsection.9.1}\protected@file@percent }
\@writefile{lol}{\contentsline {listing}{\numberline {9}{\ignorespaces Back-End Source Code Directory\relax }}{71}{listing.caption.66}\protected@file@percent }
\gdef\minted@oldcachelist{,
  default-pyg-prefix.pygstyle,
  default.pygstyle,
  491990D091B00924F22CDDCB25DB7015D72DD4FD1BB03933C0B9A800167DD0A4.pygtex,
  B8641A5D62FD0D918859650664C5AB98FFDCD102C2D228A07596D10E1DB0522E.pygtex,
  D8F54A7465E0F78661531CB7BB23BF38FCC2978B58706A55DD633101A07BCB64.pygtex,
  0657808BD00A566F4A9CDAE37F85F8BC79EFAC497A849A22C84A82F636D1375B.pygtex,
  781DDAA2D3E445DB2B803B21B69BDC40BB2B0F8E9C4538CCFD976624E1C5B8B1.pygtex,
  BC6C7D4CBFBED6DD5205390FDB0D894F1184C6D610926065792CA9E35823EA20.pygtex,
  A471AB60F704015C4949E52D5885CE2BCC70E7EC1C65B9D62F6C49D1C61E69F5.pygtex,
  EE9203CB0BA01ADEADD6B4B829EC5EF169CC6C5FAC365C3856DC565BCC8CB340.pygtex}
\@writefile{lol}{\contentsline {listing}{\numberline {10}{\ignorespaces Door Scanner Source Code Directory\relax }}{72}{listing.caption.67}\protected@file@percent }
\gdef \@abspage@last{82}
