{
  "shell_port": 57955,
  "iopub_port": 56129,
  "stdin_port": 38821,
  "control_port": 39489,
  "hb_port": 41511,
  "ip": "127.0.0.1",
  "key": "5573b0ac-94e544e281688291badf7dff",
  "transport": "tcp",
  "signature_scheme": "hmac-sha256",
  "kernel_name": ""
}