rowid,Row_location,Plot,Genotype,Nrate,Theoretical_depth,Actual_depth,Fine_roots,Coarse_roots,Total_roots,Other,Theoretical_core_height,Actual_core_height,Core_volume,Actual_fine_roots_1m2,Actual_coarse_roots_1m2,Actual_all_roots_1m2,Theoretical_fine_roots_1m2,Theoretical_coarse_roots_1m2,Theoretical_all_roots_1m2,Fine_roots_in_sample (g/m2),Coarse_roots_in_sample (g/m2),All_roots_in_sample (g/m2),Theoretical_fine_roots_in_1m,Theoretical_coarse_roots_in_1m,All_roots_in_1m
1,IR,101,TAM08001,0,0-10,0-10,0.0465,0,0.0465,0.3315,10,10,145.22,32.02038287,0,32.02038287,32.02038287,0,32.02038287,89.93251618,0,89.93251618,89.93251618,0,89.93251618
2,IR,103,TAM17800,0,0-10,0-10,0.058,0,0.058,0.2128,10,10,145.22,39.93940229,0,39.93940229,39.93940229,0,39.93940229,63.6275995,0,63.6275995,63.6275995,0,63.6275995
3,IR,104,TAM17600,0,0-10,0-10,0.0101,0,0.0101,0.1292,10,10,145.22,6.954964881,0,6.954964881,6.954964881,0,6.954964881,18.24818533,0,18.24818533,20.38579129,0,20.38579129
4,IR,209,TAM08001,0,0-10,0-10,0.0375,0,0.0375,0.3368,10,10,145.22,25.82288941,0,25.82288941,25.82288941,0,25.82288941,71.06459165,0,71.06459165,71.06459165,0,71.06459165
5,IR,212,TAM17800,0,0-10,0-10,0.0357,0,0.0357,0.1673,10,10,145.22,24.58339072,0,24.58339072,24.58339072,0,24.58339072,101.5700789,0,101.5700789,108.0795834,0,108.0795834
6,IR,301,TAM08001,0,0-10,0-10,0.0523,0,0.0523,0.1076,10,10,145.22,36.0143231,0,36.0143231,36.0143231,0,36.0143231,81.11833233,0,81.11833233,85.12783964,0,85.12783964
7,IR,303,TAM17800,0,0-10,0-10,0.0375,0,0.0375,0.1074,10,10,145.22,25.82288941,0,25.82288941,25.82288941,0,25.82288941,115.5488225,0,115.5488225,115.5488225,0,115.5488225
8,IR,415,TAM17800,0,0-10,0-10,0.0231,0,0.0231,0.1498,10,10,145.22,15.90689988,0,15.90689988,15.90689988,0,15.90689988,106.2525823,0,106.2525823,106.2525823,0,106.2525823
9,IR,416,TAM08001,0,0-10,0-10,0.161,0,0.161,0.0501,10,10,145.22,110.8662719,0,110.8662719,110.8662719,0,110.8662719,151.7697287,0,151.7697287,151.7697287,0,151.7697287
10,OR,101,TAM08001,0,0-10,0-10,0.2013,0.1953,0.3966,0.296,10,10,145.22,138.6172703,134.485608,273.1028784,138.6172703,134.485608,273.1028784,180.6225038,134.485608,315.1081118,180.6225038,134.485608,315.1081118
11,OR,103,TAM17800,0,0-10,0-10,0.1161,0.0717,0.1878,0,10,10,145.22,79.94766561,49.37336455,129.3210302,79.94766561,49.37336455,129.3210302,125.2582289,49.37336455,174.6315934,125.2582289,49.37336455,174.6315934
12,OR,104,TAM17600,0,0-10,0-10,0.0846,0,0.0846,0.3916,10,10,145.22,58.25643851,0,58.25643851,58.25643851,0,58.25643851,95.37253822,0,95.37253822,95.37253822,0,95.37253822
13,OR,209,TAM08001,0,0-10,0-10,0.0951,0.2552,0.3503,0,10,10,145.22,65.48684754,175.7333701,241.2202176,65.48684754,175.7333701,241.2202176,123.1923977,175.7333701,298.9257678,123.1923977,175.7333701,298.9257678
14,OR,212,TAM17800,0,0-10,0-10,0.0784,0,0.0784,0.1283,10,10,145.22,53.98705412,0,53.98705412,53.98705412,0,53.98705412,137.3777717,0,137.3777717,137.3777717,0,137.3777717
15,OR,301,TAM08001,0,0-10,0-10,0.0729,0.2164,0.2893,0.0857,10,10,145.22,50.19969701,149.0152872,199.2149842,50.19969701,149.0152872,199.2149842,81.87577469,162.5120507,244.3878254,81.87577469,162.5120507,244.3878254
16,OR,303,TAM17800,0,0-10,0-10,0.2138,1.0767,1.2905,0,10,10,145.22,147.2249002,741.4268007,888.6517009,147.2249002,741.4268007,888.6517009,269.1777992,747.4865721,1016.664371,269.1777992,747.4865721,1016.664371
17,OR,414,TAM17600,0,0-10,0-10,0.0848,0,0.0848,0.059,10,10,145.22,58.39416058,0,58.39416058,58.39416058,0,58.39416058,96.54317587,0,96.54317587,96.54317587,0,96.54317587
18,OR,415,TAM17800,0,0-10,0-10,0.1865,0.4445,0.631,0.3539,10,10,145.22,128.4258367,306.0873158,434.5131525,128.4258367,306.0873158,434.5131525,227.9300372,306.0873158,534.017353,227.9300372,306.0873158,534.017353
19,OR,416,TAM08001,0,0-10,0-10,0.2186,0.1982,0.4168,0.3443,10,10,145.22,150.53023,136.4825782,287.0128082,150.53023,136.4825782,287.0128082,245.6273241,136.4825782,382.1099022,245.6273241,136.4825782,382.1099022
20,IR,114,TAM17600,150,0-10,0-10,0.0296,0,0.0296,0.5697,10,10,145.22,20.38286737,0,20.38286737,20.38286737,0,20.38286737,57.7055502,0,57.7055502,57.7055502,0,57.7055502
21,IR,115,TAM17800,150,0-10,0-10,0.02,0,0.02,0.0815,10,10,145.22,13.77220768,0,13.77220768,13.77220768,0,13.77220768,269.1777992,49.85539182,319.033191,269.1777992,49.85539182,319.033191
22,IR,116,TAM08001,150,0-10,0-10,0.0149,0,0.0149,0.0803,10,10,145.22,10.26029473,0,10.26029473,10.26029473,0,10.26029473,60.87315797,0,60.87315797,60.87315797,0,60.87315797
23,IR,205,TAM17600,150,0-10,0-10,0.1319,0.5955,0.7274,0,10,10,145.22,90.82770968,410.0674838,500.8951935,90.82770968,410.0674838,500.8951935,127.1174769,410.0674838,537.1849607,127.1174769,410.0674838,537.1849607
24,IR,207,TAM08001,150,0-10,0-10,0.0133,0,0.0133,0.2388,10,10,145.22,9.15851811,0,9.15851811,9.15851811,0,9.15851811,53.78047101,0,53.78047101,53.78047101,0,53.78047101
25,IR,208,TAM17800,150,0-10,0-10,0.0467,0.0353,0.082,0.2343,10,10,145.22,32.15810494,24.30794656,56.46605151,32.15810494,24.30794656,56.46605151,88.34888843,24.30794656,112.656835,93.4643134,24.30794656,117.77226
26,IR,314,TAM17600,150,0-10,0-10,0.0097,0,0.0097,0.1342,10,10,145.22,6.679520727,0,6.679520727,6.679520727,0,6.679520727,60.45999174,0,60.45999174,60.45999174,0,60.45999174
27,IR,405,TAM17600,150,0-10,0-10,0.0448,0,0.0448,0.0721,10,10,145.22,30.84974521,0,30.84974521,30.84974521,0,30.84974521,73.13042281,0,73.13042281,73.13042281,0,73.13042281
28,IR,406,TAM17800,150,0-10,0-10,0.0265,0,0.0265,0,10,10,145.22,18.24817518,0,18.24817518,18.24817518,0,18.24817518,35.25685167,0,35.25685167,35.25685167,0,35.25685167
29,OR,114,TAM17600,150,0-10,0-10,0.0417,0.1211,0.1628,0,10,10,145.22,28.71505302,83.39071753,112.1057706,28.71505302,83.39071753,112.1057706,51.02602947,83.39071753,134.416747,51.02602947,83.39071753,134.416747
30,OR,115,TAM17800,150,0-10,0-10,0.0794,0.1697,0.2491,0.3716,10,10,145.22,54.67566451,116.8571822,171.5328467,54.67566451,116.8571822,171.5328467,121.6085939,203.8286737,325.4372676,121.6085939,203.8286737,325.4372676
31,OR,116,TAM08001,150,0-10,0-10,0.0605,0,0.0605,0.195,10,10,145.22,41.66092825,0,41.66092825,41.66092825,0,41.66092825,88.62415645,35.32571271,123.9498692,88.62415645,35.32571271,123.9498692
32,OR,205,TAM17600,150,0-10,0-10,0.0198,0,0.0198,0.0272,10,10,145.22,13.63448561,0,13.63448561,13.63448561,0,13.63448561,74.92080981,0,74.92080981,74.92080981,0,74.92080981
33,OR,207,TAM08001,150,0-10,0-10,0.049,0,0.049,2.9784,10,10,145.22,33.74190883,0,33.74190883,33.74190883,0,33.74190883,90.27682137,0,90.27682137,90.27682137,0,90.27682137
34,OR,314,TAM17600,150,0-10,0-10,0.0937,0.178,0.2717,1.2356,10,10,145.22,64.522793,122.5726484,187.0954414,64.522793,122.5726484,187.0954414,101.5700317,127.1174769,228.6875086,101.5700317,127.1174769,228.6875086
35,OR,315,TAM08001,150,0-10,0-10,0.1699,0.6122,0.7821,0,10,10,145.22,116.9949043,421.5672772,538.5621815,116.9949043,421.5672772,538.5621815,186.4756784,456.5486848,643.0243631,186.8231842,456.5486848,643.3718689
36,OR,316,TAM17800,150,0-10,0-10,0.1169,0,0.1169,0.5418,10,10,145.22,80.49855392,0,80.49855392,80.49855392,0,80.49855392,158.5181105,0,158.5181105,158.5181105,0,158.5181105
37,OR,405,TAM17600,150,0-10,0-10,0.1094,0.3374,0.4468,0,10,10,145.22,75.33397604,232.3371436,307.6711197,75.33397604,232.3371436,307.6711197,99.02217325,232.3371436,331.3593169,99.02217325,232.3371436,331.3593169
38,OR,406,TAM17800,150,0-10,0-10,0.1065,0.1933,0.2998,0.0768,10,10,145.22,73.33700592,133.1083873,206.4453932,73.33700592,133.1083873,206.4453932,148.3955378,133.1083873,281.5039251,148.3955378,133.1083873,281.5039251
39,OR,407,TAM08001,150,0-10,0-10,0.1042,0.4052,0.5094,0.2699,10,10,145.22,71.75320204,279.0249277,350.7781297,71.75320204,279.0249277,350.7781297,121.4708718,310.2189781,431.6898499,121.4708718,310.2189781,431.6898499
