time,N2Oflux,NOflux,N2flux,CH4_oxid,NIT,ANNPPT,year,treatment,NITkgNha,N2OkgNha
2018,0.930081,0.877679,0.312036,0.180834,4.637216,130.509979,2018,000_noBNI_2018,46.37216,9.30081
2019,1.223752,1.179517,0.498635,0.171579,5.871735,128.499969,2019,000_noBNI_2018,58.71735,12.23752
2018,0.925139,0.874855,0.311594,0.180834,4.575532,130.509979,2018,000_measBNI_2018,45.75532,9.25139
2019,1.223835,1.179561,0.498742,0.171579,5.872009,128.499969,2019,000_measBNI_2018,58.72009,12.23835
2018,0.87453,0.846103,0.304514,0.180832,3.965914,130.509979,2018,000_maxBNI_2018,39.65914,8.7453
2019,1.225464,1.180834,0.499166,0.171572,5.881714,128.499969,2019,000_maxBNI_2018,58.81714,12.25464
2018,1.510143,1.400536,0.358228,0.180814,10.496719,130.509979,2018,100_noBNI_2018,104.96719,15.10143
2019,1.314462,1.250884,0.495264,0.171136,6.529297,128.499969,2019,100_noBNI_2018,65.29297,13.14462
2018,1.502498,1.396314,0.357998,0.180814,10.401511,130.509979,2018,100_measBNI_2018,104.01511,15.02498
2019,1.314577,1.250963,0.495264,0.171135,6.530258,128.499969,2019,100_measBNI_2018,65.30258,13.14577
2018,1.414819,1.348691,0.353376,0.180812,9.339088,130.509979,2018,100_maxBNI_2018,93.39088,14.14819
2019,1.317598,1.253262,0.495223,0.171116,6.554486,128.499969,2019,100_maxBNI_2018,65.54486,13.17598
