time,dayofyr,crpval,agcacc,bgcjacc,bgcmacc,cgrain,egrain(N),egrain(P),egrain(S),crmvst,ermvst(N),ermvst(P),ermvst(S),cstraw,estraw(N),estraw(P),estraw(S),stdstraw,estdstraw(N),estdstraw(P),estdstraw(S),addsdc,addsde(N),addsde(P),addsde(S),resid,reside(N),reside(P),reside(S),irrapp,fertapp(N),fertapp(P),fertapp(S),omadapp,omaeapp(N),omaeapp(P),omaeapp(S),strmac(1),strmac(2),strmac(3),strmac(4),strmac(5),strmac(6),strmac(7),strmac(8),cgracc,egracc(N),egracc(P),egracc(S),accrst,accrste(N),accrste(P),accrste(S),ctubesj,etubesj(N),etubesj(P),etubesj(S),ctubesm,etubesm(N),etubesm(P),etubesm(S),srfclittrj,srfclittrj(N),esrfclittrj(P),esrfclittrj(S),soillittrj,esoillittrj(N),esoillittrj(P),esoillittrj(S),srfclittrm,esrfclittrm(N),esrfclittrm(P),esrfclittrm(S),soillittrm,esoillittrm(N),esoillittrm(P),esoillittrm(S)
2008.75,302,3.1000,876.7198,291.0782,15.3199,518.0341,13.8467,0.0000,0.0000,321.9158,3.6028,0.0000,0.0000,321.9158,3.6028,0.0000,0.0000,0.0000,0.0000,0.0000,0.0000,17.8842,0.2002,0.0000,0.0000,17.8842,0.2002,0.0000,0.0000,0.0000,16.8000,0.0000,0.0000,0.0000,0.0000,0.0000,0.0000,37.0725,0.8032,0.0000,0.0000,0.6425,0.0295,0.0000,0.0000,518.0341,13.8467,0.0000,0.0000,321.9158,0.0000,0.0000,0.0000,0.0000,0.0000,0.0000,0.0000,0.0000,0.0000,0.0000,0.0000,10.1887,0.2197,0.0000,0.0000,193.5855,4.1738,0.0000,0.0000,2.4576,0.0538,0.0000,0.0000,46.6938,1.0230,0.0000,0.0000
2009.83,307,3.1000,823.3663,298.4262,15.7067,493.1036,13.2699,0.0000,0.0000,295.8622,3.3440,0.0000,0.0000,295.8622,3.3440,0.0000,0.0000,0.0000,0.0000,0.0000,0.0000,16.4368,0.1858,0.0000,0.0000,16.4368,0.1858,0.0000,0.0000,0.0000,20.2000,0.0000,0.0000,0.0000,0.0000,0.0000,0.0000,37.6955,1.2286,0.0000,0.0000,0.6763,0.0297,0.0000,0.0000,493.1036,13.2699,0.0000,0.0000,295.8622,0.0000,0.0000,0.0000,0.0000,0.0000,0.0000,0.0000,0.0000,0.0000,0.0000,0.0000,10.3899,0.2234,0.0000,0.0000,197.4081,4.2443,0.0000,0.0000,2.4768,0.0541,0.0000,0.0000,47.0601,1.0273,0.0000,0.0000
2010.75,285,60.2000,201.1620,60.5099,3.1847,65.9980,9.9393,0.0000,0.0000,0.0000,0.0000,0.0000,0.0000,0.0000,0.0000,0.0000,0.0000,0.0000,0.0000,0.0000,0.0000,67.2000,2.1582,0.0000,0.0000,67.2000,2.1582,0.0000,0.0000,0.0000,0.0000,0.0000,0.0000,0.0000,0.0000,0.0000,0.0000,31.5334,1.0396,0.0000,0.0000,0.7674,0.0328,0.0000,0.0000,65.9980,9.9393,0.0000,0.0000,0.0000,0.0000,0.0000,0.0000,0.0000,0.0000,0.0000,0.0000,0.0000,0.0000,0.0000,0.0000,1.9530,0.0807,0.0000,0.0000,37.1065,1.5337,0.0000,0.0000,0.5761,0.0237,0.0000,0.0000,10.9464,0.4508,0.0000,0.0000
2012.92,350,44.2000,431.0194,110.6781,5.8252,0.0000,0.0000,0.0000,0.0000,288.7208,0.9019,0.0000,0.0000,0.0595,0.0029,0.0000,0.0000,288.6613,0.8991,0.0000,0.0000,0.0000,0.0000,0.0000,0.0000,0.0000,0.0000,0.0000,0.0000,0.0000,2.3000,0.0000,0.0000,0.0000,0.0000,0.0000,0.0000,4.4586,0.1159,0.0000,0.0000,0.1690,0.0079,0.0000,0.0000,0.0000,0.0000,0.0000,0.0000,288.7208,0.9019,0.0000,0.0000,0.0000,0.0000,0.0000,0.0000,0.0000,0.0000,0.0000,0.0000,0.6800,0.0170,0.0000,0.0000,4.1773,0.1044,0.0000,0.0000,0.5087,0.0127,0.0000,0.0000,3.1251,0.0781,0.0000,0.0000
2013.92,350,44.3000,1020.7787,327.5023,17.2370,0.0000,0.0000,0.0000,0.0000,666.4733,1.3195,0.0000,0.0000,0.2021,0.0092,0.0000,0.0000,666.2712,1.3103,0.0000,0.0000,0.0000,0.0000,0.0000,0.0000,0.0000,0.0000,0.0000,0.0000,0.0000,2.3000,0.0000,0.0000,0.0000,0.0000,0.0000,0.0000,28.8420,0.3131,0.0000,0.0000,0.2503,0.0116,0.0000,0.0000,0.0000,0.0000,0.0000,0.0000,666.4733,1.3195,0.0000,0.0000,0.0000,0.0000,0.0000,0.0000,0.0000,0.0000,0.0000,0.0000,2.1685,0.0463,0.0000,0.0000,13.3207,0.2846,0.0000,0.0000,1.3853,0.0314,0.0000,0.0000,8.5094,0.1930,0.0000,0.0000
2014.92,350,44.4000,1083.1707,363.6563,19.1398,0.0000,0.0000,0.0000,0.0000,720.3669,1.3808,0.0000,0.0000,6.7904,0.1351,0.0000,0.0000,713.5766,1.2456,0.0000,0.0000,0.0000,0.0000,0.0000,0.0000,0.0000,0.0000,0.0000,0.0000,0.0000,2.3000,0.0000,0.0000,0.0000,0.0000,0.0000,0.0000,16.5853,0.0635,0.0000,0.0000,0.2999,0.0127,0.0000,0.0000,0.0000,0.0000,0.0000,0.0000,720.3669,1.3808,0.0000,0.0000,0.0000,0.0000,0.0000,0.0000,0.0000,0.0000,0.0000,0.0000,2.6998,0.0554,0.0000,0.0000,16.5843,0.3406,0.0000,0.0000,2.2008,0.0477,0.0000,0.0000,13.5193,0.2933,0.0000,0.0000
2015.92,350,44.5000,784.0343,245.1799,12.9042,0.0000,0.0000,0.0000,0.0000,527.1334,1.2559,0.0000,0.0000,5.0283,0.1251,0.0000,0.0000,522.1050,1.1308,0.0000,0.0000,0.0000,0.0000,0.0000,0.0000,0.0000,0.0000,0.0000,0.0000,0.0000,2.3000,0.0000,0.0000,0.0000,0.0000,0.0000,0.0000,20.1557,0.0230,0.0000,0.0000,0.4652,0.0190,0.0000,0.0000,0.0000,0.0000,0.0000,0.0000,527.1334,1.2559,0.0000,0.0000,0.0000,0.0000,0.0000,0.0000,0.0000,0.0000,0.0000,0.0000,2.0045,0.0428,0.0000,0.0000,12.3135,0.2629,0.0000,0.0000,2.5270,0.0547,0.0000,0.0000,15.5231,0.3363,0.0000,0.0000
2016.75,296,3.1000,1059.6769,353.5905,18.6100,634.9596,15.9156,0.0000,0.0000,380.9757,4.0107,0.0000,0.0000,380.9757,4.0107,0.0000,0.0000,0.0000,0.0000,0.0000,0.0000,21.1653,0.2228,0.0000,0.0000,21.1653,0.2228,0.0000,0.0000,0.0000,20.2000,0.0000,0.0000,0.0000,0.0000,0.0000,0.0000,21.3907,0.0114,0.0000,0.0000,0.2770,0.0119,0.0000,0.0000,634.9596,15.9156,0.0000,0.0000,380.9757,0.0000,0.0000,0.0000,0.0000,0.0000,0.0000,0.0000,0.0000,0.0000,0.0000,0.0000,13.9527,0.2981,0.0000,0.0000,265.1006,5.6632,0.0000,0.0000,10.8273,0.2348,0.0000,0.0000,205.7178,4.4609,0.0000,0.0000
2017.75,285,60.2000,149.2612,49.6745,2.6144,47.2755,7.9766,0.0000,0.0000,0.0000,0.0000,0.0000,0.0000,0.0000,0.0000,0.0000,0.0000,0.0000,0.0000,0.0000,0.0000,50.7997,1.8372,0.0000,0.0000,50.7997,1.8372,0.0000,0.0000,0.0000,0.0000,0.0000,0.0000,0.0000,0.0000,0.0000,0.0000,29.3733,0.1317,0.0000,0.0000,0.5439,0.0218,0.0000,0.0000,47.2755,7.9766,0.0000,0.0000,0.0000,0.0000,0.0000,0.0000,0.0000,0.0000,0.0000,0.0000,0.0000,0.0000,0.0000,0.0000,1.6036,0.0660,0.0000,0.0000,30.4690,1.2534,0.0000,0.0000,0.4742,0.0195,0.0000,0.0000,9.0095,0.3699,0.0000,0.0000
2018.75,288,59.1000,1137.4335,123.4421,6.4970,0.1131,0.0208,0.0000,0.0000,1077.0808,18.9502,0.0000,0.0000,1077.0808,18.9502,0.0000,0.0000,0.0000,0.0000,0.0000,0.0000,11.3377,0.1995,0.0000,0.0000,45.3508,0.7979,0.0000,0.0000,0.0000,16.8000,0.0000,0.0000,0.0000,0.0000,0.0000,0.0000,27.2144,0.2728,0.0000,0.0000,0.5877,0.0259,0.0000,0.0000,0.1131,0.0208,0.0000,0.0000,1077.0808,0.0000,0.0000,0.0000,0.0000,0.0000,0.0000,0.0000,0.0000,0.0000,0.0000,0.0000,4.4379,0.0936,0.0000,0.0000,84.3204,1.7790,0.0000,0.0000,1.0680,0.0230,0.0000,0.0000,20.2913,0.4373,0.0000,0.0000
2019.75,285,60.2000,250.2518,59.3655,3.1245,82.6871,11.4195,0.0000,0.0000,0.0000,0.0000,0.0000,0.0000,0.0000,0.0000,0.0000,0.0000,0.0000,0.0000,0.0000,0.0000,83.5153,2.4575,0.0000,0.0000,83.5153,2.4575,0.0000,0.0000,0.0000,0.0000,0.0000,0.0000,0.0000,0.0000,0.0000,0.0000,48.0932,0.6264,0.0000,0.0000,0.6588,0.0284,0.0000,0.0000,82.6871,11.4195,0.0000,0.0000,0.0000,0.0000,0.0000,0.0000,0.0000,0.0000,0.0000,0.0000,0.0000,0.0000,0.0000,0.0000,2.0661,0.0856,0.0000,0.0000,39.2561,1.6255,0.0000,0.0000,0.5487,0.0227,0.0000,0.0000,10.4247,0.4312,0.0000,0.0000
2020.75,288,59.1000,1078.0908,117.3113,6.1743,0.1068,0.0205,0.0000,0.0000,1020.0700,18.7008,0.0000,0.0000,1020.0700,18.7008,0.0000,0.0000,0.0000,0.0000,0.0000,0.0000,10.7376,0.1969,0.0000,0.0000,42.9503,0.7874,0.0000,0.0000,0.0000,16.8000,0.0000,0.0000,0.0000,0.0000,0.0000,0.0000,44.2505,1.0306,0.0000,0.0000,0.4129,0.0185,0.0000,0.0000,0.1068,0.0205,0.0000,0.0000,1020.0700,0.0000,0.0000,0.0000,0.0000,0.0000,0.0000,0.0000,0.0000,0.0000,0.0000,0.0000,4.3581,0.0964,0.0000,0.0000,82.8045,1.8318,0.0000,0.0000,0.9235,0.0204,0.0000,0.0000,17.5469,0.3868,0.0000,0.0000
2021.75,285,60.2000,224.2930,57.3964,3.0209,73.8481,10.6624,0.0000,0.0000,0.0000,0.0000,0.0000,0.0000,0.0000,0.0000,0.0000,0.0000,0.0000,0.0000,0.0000,0.0000,74.9670,2.3075,0.0000,0.0000,74.9670,2.3075,0.0000,0.0000,0.0000,0.0000,0.0000,0.0000,0.0000,0.0000,0.0000,0.0000,35.1161,0.9823,0.0000,0.0000,0.3108,0.0139,0.0000,0.0000,73.8481,10.6624,0.0000,0.0000,0.0000,0.0000,0.0000,0.0000,0.0000,0.0000,0.0000,0.0000,0.0000,0.0000,0.0000,0.0000,2.0386,0.0843,0.0000,0.0000,38.7343,1.6023,0.0000,0.0000,0.5012,0.0207,0.0000,0.0000,9.5227,0.3932,0.0000,0.0000
2022.75,288,59.1000,1089.9495,124.2794,6.5410,0.1086,0.0205,0.0000,0.0000,1032.6210,18.6749,0.0000,0.0000,1032.6210,18.6749,0.0000,0.0000,0.0000,0.0000,0.0000,0.0000,10.8697,0.1966,0.0000,0.0000,43.4788,0.7863,0.0000,0.0000,0.0000,16.8000,0.0000,0.0000,0.0000,0.0000,0.0000,0.0000,28.7814,0.8555,0.0000,0.0000,0.2914,0.0133,0.0000,0.0000,0.1086,0.0205,0.0000,0.0000,1032.6210,0.0000,0.0000,0.0000,0.0000,0.0000,0.0000,0.0000,0.0000,0.0000,0.0000,0.0000,4.1363,0.0902,0.0000,0.0000,78.5897,1.7129,0.0000,0.0000,1.0551,0.0232,0.0000,0.0000,20.0463,0.4401,0.0000,0.0000
2023.75,285,60.2000,169.2939,55.5108,2.9216,52.0953,8.6188,0.0000,0.0000,0.0000,0.0000,0.0000,0.0000,0.0000,0.0000,0.0000,0.0000,0.0000,0.0000,0.0000,0.0000,58.3490,2.0754,0.0000,0.0000,58.3490,2.0754,0.0000,0.0000,0.0000,0.0000,0.0000,0.0000,0.0000,0.0000,0.0000,0.0000,26.7800,0.7396,0.0000,0.0000,0.2312,0.0104,0.0000,0.0000,52.0953,8.6188,0.0000,0.0000,0.0000,0.0000,0.0000,0.0000,0.0000,0.0000,0.0000,0.0000,0.0000,0.0000,0.0000,0.0000,1.7525,0.0724,0.0000,0.0000,33.2982,1.3761,0.0000,0.0000,0.5335,0.0220,0.0000,0.0000,10.1369,0.4185,0.0000,0.0000
2024.75,288,59.1000,1065.4895,126.4748,6.6566,0.1059,0.0202,0.0000,0.0000,1008.4539,18.3846,0.0000,0.0000,1008.4539,18.3846,0.0000,0.0000,0.0000,0.0000,0.0000,0.0000,10.6153,0.1935,0.0000,0.0000,42.4612,0.7741,0.0000,0.0000,0.0000,16.8000,0.0000,0.0000,0.0000,0.0000,0.0000,0.0000,11.6393,0.3446,0.0000,0.0000,0.1139,0.0053,0.0000,0.0000,0.1059,0.0202,0.0000,0.0000,1008.4539,0.0000,0.0000,0.0000,0.0000,0.0000,0.0000,0.0000,0.0000,0.0000,0.0000,0.0000,4.4200,0.0974,0.0000,0.0000,83.9809,1.8510,0.0000,0.0000,1.0871,0.0238,0.0000,0.0000,20.6546,0.4518,0.0000,0.0000
2025.75,285,60.2000,190.7726,56.9258,2.9961,52.3458,8.7504,0.0000,0.0000,0.0000,0.0000,0.0000,0.0000,0.0000,0.0000,0.0000,0.0000,0.0000,0.0000,0.0000,0.0000,68.8482,2.4865,0.0000,0.0000,68.8482,2.4865,0.0000,0.0000,0.0000,0.0000,0.0000,0.0000,0.0000,0.0000,0.0000,0.0000,40.5319,1.3395,0.0000,0.0000,0.3668,0.0162,0.0000,0.0000,52.3458,8.7504,0.0000,0.0000,0.0000,0.0000,0.0000,0.0000,0.0000,0.0000,0.0000,0.0000,0.0000,0.0000,0.0000,0.0000,1.8424,0.0759,0.0000,0.0000,35.0047,1.4427,0.0000,0.0000,0.5352,0.0220,0.0000,0.0000,10.1683,0.4183,0.0000,0.0000
2026.75,288,59.1000,1079.7288,113.3169,5.9641,0.1071,0.0204,0.0000,0.0000,1022.4969,18.6325,0.0000,0.0000,1022.4969,18.6325,0.0000,0.0000,0.0000,0.0000,0.0000,0.0000,10.7631,0.1961,0.0000,0.0000,43.0525,0.7845,0.0000,0.0000,0.0000,16.8000,0.0000,0.0000,0.0000,0.0000,0.0000,0.0000,30.2408,0.8335,0.0000,0.0000,0.2177,0.0100,0.0000,0.0000,0.1071,0.0204,0.0000,0.0000,1022.4969,0.0000,0.0000,0.0000,0.0000,0.0000,0.0000,0.0000,0.0000,0.0000,0.0000,0.0000,4.2197,0.0930,0.0000,0.0000,80.1749,1.7677,0.0000,0.0000,0.8840,0.0194,0.0000,0.0000,16.7957,0.3680,0.0000,0.0000
2027.75,285,60.2000,243.0063,57.9986,3.0526,80.3059,11.1570,0.0000,0.0000,0.0000,0.0000,0.0000,0.0000,0.0000,0.0000,0.0000,0.0000,0.0000,0.0000,0.0000,0.0000,81.0851,2.4002,0.0000,0.0000,81.0851,2.4002,0.0000,0.0000,0.0000,0.0000,0.0000,0.0000,0.0000,0.0000,0.0000,0.0000,28.7452,1.0679,0.0000,0.0000,0.4545,0.0199,0.0000,0.0000,80.3059,11.1570,0.0000,0.0000,0.0000,0.0000,0.0000,0.0000,0.0000,0.0000,0.0000,0.0000,0.0000,0.0000,0.0000,0.0000,2.0196,0.0833,0.0000,0.0000,38.3725,1.5833,0.0000,0.0000,0.5355,0.0221,0.0000,0.0000,10.1738,0.4192,0.0000,0.0000
2028.75,288,59.1000,1173.8063,124.9951,6.5787,0.1171,0.0213,0.0000,0.0000,1112.0973,19.4414,0.0000,0.0000,1112.0973,19.4414,0.0000,0.0000,0.0000,0.0000,0.0000,0.0000,11.7063,0.2046,0.0000,0.0000,46.8252,0.8186,0.0000,0.0000,0.0000,16.8000,0.0000,0.0000,0.0000,0.0000,0.0000,0.0000,21.2973,0.7561,0.0000,0.0000,0.2004,0.0091,0.0000,0.0000,0.1171,0.0213,0.0000,0.0000,1112.0973,0.0000,0.0000,0.0000,0.0000,0.0000,0.0000,0.0000,0.0000,0.0000,0.0000,0.0000,4.4805,0.0936,0.0000,0.0000,85.1303,1.7783,0.0000,0.0000,1.0911,0.0236,0.0000,0.0000,20.7301,0.4484,0.0000,0.0000
2029.75,285,60.2000,163.3674,53.0544,2.7923,50.9493,8.4469,0.0000,0.0000,0.0000,0.0000,0.0000,0.0000,0.0000,0.0000,0.0000,0.0000,0.0000,0.0000,0.0000,0.0000,55.9757,1.9926,0.0000,0.0000,55.9757,1.9926,0.0000,0.0000,0.0000,0.0000,0.0000,0.0000,0.0000,0.0000,0.0000,0.0000,28.5119,0.8375,0.0000,0.0000,0.2209,0.0094,0.0000,0.0000,50.9493,8.4469,0.0000,0.0000,0.0000,0.0000,0.0000,0.0000,0.0000,0.0000,0.0000,0.0000,0.0000,0.0000,0.0000,0.0000,1.6781,0.0692,0.0000,0.0000,31.8847,1.3148,0.0000,0.0000,0.5147,0.0212,0.0000,0.0000,9.7798,0.4033,0.0000,0.0000
2030.75,288,59.1000,1100.2133,122.5849,6.4518,0.1093,0.0200,0.0000,0.0000,1041.6400,18.2102,0.0000,0.0000,1041.6400,18.2102,0.0000,0.0000,0.0000,0.0000,0.0000,0.0000,10.9646,0.1917,0.0000,0.0000,43.8585,0.7667,0.0000,0.0000,0.0000,16.8000,0.0000,0.0000,0.0000,0.0000,0.0000,0.0000,27.2107,0.6980,0.0000,0.0000,0.2939,0.0133,0.0000,0.0000,0.1093,0.0200,0.0000,0.0000,1041.6400,0.0000,0.0000,0.0000,0.0000,0.0000,0.0000,0.0000,0.0000,0.0000,0.0000,0.0000,4.3980,0.0906,0.0000,0.0000,83.5615,1.7219,0.0000,0.0000,1.0647,0.0227,0.0000,0.0000,20.2287,0.4322,0.0000,0.0000
