time,dayofyr,crpval,agcacc,bgcjacc,bgcmacc,cgrain,egrain(N),egrain(P),egrain(S),crmvst,ermvst(N),ermvst(P),ermvst(S),cstraw,estraw(N),estraw(P),estraw(S),stdstraw,estdstraw(N),estdstraw(P),estdstraw(S),addsdc,addsde(N),addsde(P),addsde(S),resid,reside(N),reside(P),reside(S),irrapp,fertapp(N),fertapp(P),fertapp(S),omadapp,omaeapp(N),omaeapp(P),omaeapp(S),strmac(1),strmac(2),strmac(3),strmac(4),strmac(5),strmac(6),strmac(7),strmac(8),cgracc,egracc(N),egracc(P),egracc(S),accrst,accrste(N),accrste(P),accrste(S),ctubesj,etubesj(N),etubesj(P),etubesj(S),ctubesm,etubesm(N),etubesm(P),etubesm(S),srfclittrj,srfclittrj(N),esrfclittrj(P),esrfclittrj(S),soillittrj,esoillittrj(N),esoillittrj(P),esoillittrj(S),srfclittrm,esrfclittrm(N),esrfclittrm(P),esrfclittrm(S),soillittrm,esoillittrm(N),esoillittrm(P),esoillittrm(S)
1848.75,289,3.1000,97.9920,30.2191,1.5905,34.1898,1.5807,0.0000,0.0000,57.1459,1.3088,0.0000,0.0000,57.1459,1.3088,0.0000,0.0000,0.0000,0.0000,0.0000,0.0000,3.1748,0.0727,0.0000,0.0000,3.1748,0.0727,0.0000,0.0000,0.0000,0.0000,0.0000,0.0000,250.0000,6.2500,0.0000,0.0000,9.2473,0.0664,0.0000,0.0000,0.4171,0.0162,0.0000,0.0000,34.1898,1.5807,0.0000,0.0000,57.1459,0.0000,0.0000,0.0000,0.0000,0.0000,0.0000,0.0000,0.0000,0.0000,0.0000,0.0000,0.9500,0.0195,0.0000,0.0000,18.0492,0.3701,0.0000,0.0000,0.3191,0.0064,0.0000,0.0000,6.0626,0.1224,0.0000,0.0000
1849.75,289,3.1000,138.4996,35.9581,1.8925,48.2355,2.3182,0.0000,0.0000,80.6223,1.9195,0.0000,0.0000,80.6223,1.9195,0.0000,0.0000,0.0000,0.0000,0.0000,0.0000,4.4790,0.1066,0.0000,0.0000,4.4790,0.1066,0.0000,0.0000,0.0000,0.0000,0.0000,0.0000,250.0000,6.2500,0.0000,0.0000,35.4948,0.2231,0.0000,0.0000,0.9011,0.0378,0.0000,0.0000,48.2355,2.3182,0.0000,0.0000,80.6223,0.0000,0.0000,0.0000,0.0000,0.0000,0.0000,0.0000,0.0000,0.0000,0.0000,0.0000,1.1702,0.0257,0.0000,0.0000,22.2347,0.4890,0.0000,0.0000,0.3617,0.0080,0.0000,0.0000,6.8725,0.1513,0.0000,0.0000
1850.75,289,3.1000,117.7129,34.7637,1.8297,40.9501,2.0811,0.0000,0.0000,68.4452,1.7231,0.0000,0.0000,68.4452,1.7231,0.0000,0.0000,0.0000,0.0000,0.0000,0.0000,3.8025,0.0957,0.0000,0.0000,3.8025,0.0957,0.0000,0.0000,0.0000,0.0000,0.0000,0.0000,250.0000,6.2500,0.0000,0.0000,38.4122,0.1376,0.0000,0.0000,0.2837,0.0128,0.0000,0.0000,40.9501,2.0811,0.0000,0.0000,68.4452,0.0000,0.0000,0.0000,0.0000,0.0000,0.0000,0.0000,0.0000,0.0000,0.0000,0.0000,1.0996,0.0243,0.0000,0.0000,20.8928,0.4625,0.0000,0.0000,0.3489,0.0077,0.0000,0.0000,6.6285,0.1468,0.0000,0.0000
1851.75,289,23.0000,112.1732,32.8263,1.7277,11.2071,0.8454,0.0000,0.0000,19.0756,0.4638,0.0000,0.0000,19.0756,0.4638,0.0000,0.0000,0.0000,0.0000,0.0000,0.0000,1.0598,0.0258,0.0000,0.0000,1.0598,0.0258,0.0000,0.0000,0.0000,0.0000,0.0000,0.0000,0.0000,0.0000,0.0000,0.0000,25.9152,0.3584,0.0000,0.0000,0.3618,0.0165,0.0000,0.0000,11.2071,0.8454,0.0000,0.0000,19.0756,0.0000,0.0000,0.0000,0.0000,0.0000,0.0000,0.0000,0.0000,0.0000,0.0000,0.0000,0.9193,0.0204,0.0000,0.0000,17.4664,0.3881,0.0000,0.0000,0.4014,0.0089,0.0000,0.0000,7.6269,0.1695,0.0000,0.0000
1854.75,289,3.1000,126.5285,37.8949,1.9945,41.3068,2.1445,0.0000,0.0000,76.0125,1.8954,0.0000,0.0000,76.0125,1.8954,0.0000,0.0000,0.0000,0.0000,0.0000,0.0000,4.2229,0.1053,0.0000,0.0000,4.2229,0.1053,0.0000,0.0000,0.0000,0.0000,0.0000,0.0000,250.0000,6.2500,0.0000,0.0000,18.7276,0.3366,0.0000,0.0000,0.6255,0.0320,0.0000,0.0000,41.3068,2.1445,0.0000,0.0000,76.0125,0.0000,0.0000,0.0000,0.0000,0.0000,0.0000,0.0000,0.0000,0.0000,0.0000,0.0000,1.1843,0.0263,0.0000,0.0000,22.5012,0.5000,0.0000,0.0000,0.3973,0.0088,0.0000,0.0000,7.5485,0.1677,0.0000,0.0000
1855.75,289,3.1000,144.1741,40.1677,2.1141,50.2787,2.4316,0.0000,0.0000,83.7813,2.0092,0.0000,0.0000,83.7813,2.0092,0.0000,0.0000,0.0000,0.0000,0.0000,0.0000,4.6545,0.1116,0.0000,0.0000,4.6545,0.1116,0.0000,0.0000,0.0000,0.0000,0.0000,0.0000,250.0000,6.2500,0.0000,0.0000,14.5621,0.3176,0.0000,0.0000,0.4002,0.0203,0.0000,0.0000,50.2787,2.4316,0.0000,0.0000,83.7813,0.0000,0.0000,0.0000,0.0000,0.0000,0.0000,0.0000,0.0000,0.0000,0.0000,0.0000,1.2819,0.0284,0.0000,0.0000,24.3556,0.5405,0.0000,0.0000,0.4129,0.0092,0.0000,0.0000,7.8455,0.1739,0.0000,0.0000
1856.75,289,3.1000,80.5166,31.4302,1.6542,26.4533,1.5202,0.0000,0.0000,47.8164,1.3273,0.0000,0.0000,47.8164,1.3273,0.0000,0.0000,0.0000,0.0000,0.0000,0.0000,2.6565,0.0737,0.0000,0.0000,2.6565,0.0737,0.0000,0.0000,0.0000,0.0000,0.0000,0.0000,250.0000,6.2500,0.0000,0.0000,19.9105,0.1632,0.0000,0.0000,0.0499,0.0024,0.0000,0.0000,26.4533,1.5202,0.0000,0.0000,47.8164,0.0000,0.0000,0.0000,0.0000,0.0000,0.0000,0.0000,0.0000,0.0000,0.0000,0.0000,0.8931,0.0198,0.0000,0.0000,16.9692,0.3771,0.0000,0.0000,0.3356,0.0075,0.0000,0.0000,6.3771,0.1417,0.0000,0.0000
1857.75,289,23.0000,109.5507,33.6872,1.7730,13.0465,0.9612,0.0000,0.0000,21.8063,0.5190,0.0000,0.0000,21.8063,0.5190,0.0000,0.0000,0.0000,0.0000,0.0000,0.0000,1.2115,0.0288,0.0000,0.0000,1.2115,0.0288,0.0000,0.0000,0.0000,0.0000,0.0000,0.0000,0.0000,0.0000,0.0000,0.0000,34.1487,0.6371,0.0000,0.0000,0.5149,0.0254,0.0000,0.0000,13.0465,0.9612,0.0000,0.0000,21.8063,0.0000,0.0000,0.0000,0.0000,0.0000,0.0000,0.0000,0.0000,0.0000,0.0000,0.0000,0.9579,0.0213,0.0000,0.0000,18.2000,0.4044,0.0000,0.0000,0.4007,0.0089,0.0000,0.0000,7.6130,0.1692,0.0000,0.0000
1860.75,289,3.1000,108.6968,28.6494,1.5079,37.8838,1.9804,0.0000,0.0000,63.3201,1.6398,0.0000,0.0000,63.3201,1.6398,0.0000,0.0000,0.0000,0.0000,0.0000,0.0000,3.5178,0.0911,0.0000,0.0000,3.5178,0.0911,0.0000,0.0000,0.0000,0.0000,0.0000,0.0000,250.0000,6.2500,0.0000,0.0000,24.3234,0.6971,0.0000,0.0000,0.5222,0.0277,0.0000,0.0000,37.8838,1.9804,0.0000,0.0000,63.3201,0.0000,0.0000,0.0000,0.0000,0.0000,0.0000,0.0000,0.0000,0.0000,0.0000,0.0000,0.9360,0.0208,0.0000,0.0000,17.7843,0.3952,0.0000,0.0000,0.2869,0.0064,0.0000,0.0000,5.4514,0.1211,0.0000,0.0000
1861.75,289,3.1000,134.0279,33.2143,1.7481,46.6888,2.3106,0.0000,0.0000,78.0371,1.9131,0.0000,0.0000,78.0371,1.9131,0.0000,0.0000,0.0000,0.0000,0.0000,0.0000,4.3354,0.1063,0.0000,0.0000,4.3354,0.1063,0.0000,0.0000,0.0000,0.0000,0.0000,0.0000,250.0000,6.2500,0.0000,0.0000,51.0917,1.1595,0.0000,0.0000,0.7590,0.0384,0.0000,0.0000,46.6888,2.3106,0.0000,0.0000,78.0371,0.0000,0.0000,0.0000,0.0000,0.0000,0.0000,0.0000,0.0000,0.0000,0.0000,0.0000,1.0712,0.0238,0.0000,0.0000,20.3537,0.4523,0.0000,0.0000,0.3352,0.0074,0.0000,0.0000,6.3681,0.1415,0.0000,0.0000
1862.75,289,3.1000,98.7900,34.6869,1.8256,34.3085,1.8360,0.0000,0.0000,57.3443,1.5202,0.0000,0.0000,57.3443,1.5202,0.0000,0.0000,0.0000,0.0000,0.0000,0.0000,3.1858,0.0845,0.0000,0.0000,3.1858,0.0845,0.0000,0.0000,0.0000,0.0000,0.0000,0.0000,250.0000,6.2500,0.0000,0.0000,28.0630,0.6927,0.0000,0.0000,0.1763,0.0086,0.0000,0.0000,34.3085,1.8360,0.0000,0.0000,57.3443,0.0000,0.0000,0.0000,0.0000,0.0000,0.0000,0.0000,0.0000,0.0000,0.0000,0.0000,1.0698,0.0238,0.0000,0.0000,20.3258,0.4517,0.0000,0.0000,0.3721,0.0083,0.0000,0.0000,7.0700,0.1571,0.0000,0.0000
1863.75,289,23.0000,114.6218,33.1985,1.7473,14.4008,1.0463,0.0000,0.0000,24.0698,0.5650,0.0000,0.0000,24.0698,0.5650,0.0000,0.0000,0.0000,0.0000,0.0000,0.0000,1.3372,0.0314,0.0000,0.0000,1.3372,0.0314,0.0000,0.0000,0.0000,0.0000,0.0000,0.0000,0.0000,0.0000,0.0000,0.0000,20.5904,0.5206,0.0000,0.0000,0.3814,0.0189,0.0000,0.0000,14.4008,1.0463,0.0000,0.0000,24.0698,0.0000,0.0000,0.0000,0.0000,0.0000,0.0000,0.0000,0.0000,0.0000,0.0000,0.0000,0.9271,0.0206,0.0000,0.0000,17.6143,0.3914,0.0000,0.0000,0.4059,0.0090,0.0000,0.0000,7.7122,0.1714,0.0000,0.0000
1866.75,289,3.1000,132.1944,38.6004,2.0316,43.4258,2.2197,0.0000,0.0000,78.9635,1.9459,0.0000,0.0000,78.9635,1.9459,0.0000,0.0000,0.0000,0.0000,0.0000,0.0000,4.3869,0.1081,0.0000,0.0000,4.3869,0.1081,0.0000,0.0000,0.0000,0.0000,0.0000,0.0000,250.0000,6.2500,0.0000,0.0000,48.9024,1.6119,0.0000,0.0000,0.8793,0.0448,0.0000,0.0000,43.4258,2.2197,0.0000,0.0000,78.9635,0.0000,0.0000,0.0000,0.0000,0.0000,0.0000,0.0000,0.0000,0.0000,0.0000,0.0000,1.1956,0.0266,0.0000,0.0000,22.7166,0.5048,0.0000,0.0000,0.4084,0.0091,0.0000,0.0000,7.7589,0.1724,0.0000,0.0000
1867.75,289,3.1000,115.4781,36.9460,1.9445,38.8416,2.0335,0.0000,0.0000,68.0882,1.7390,0.0000,0.0000,68.0882,1.7390,0.0000,0.0000,0.0000,0.0000,0.0000,0.0000,3.7827,0.0966,0.0000,0.0000,3.7827,0.0966,0.0000,0.0000,0.0000,0.0000,0.0000,0.0000,250.0000,6.2500,0.0000,0.0000,33.1528,0.6489,0.0000,0.0000,0.5579,0.0284,0.0000,0.0000,38.8416,2.0335,0.0000,0.0000,68.0882,0.0000,0.0000,0.0000,0.0000,0.0000,0.0000,0.0000,0.0000,0.0000,0.0000,0.0000,1.1569,0.0257,0.0000,0.0000,21.9820,0.4885,0.0000,0.0000,0.3830,0.0085,0.0000,0.0000,7.2779,0.1617,0.0000,0.0000
1868.75,289,3.1000,113.2812,34.2402,1.8021,39.0888,2.0312,0.0000,0.0000,66.1300,1.6957,0.0000,0.0000,66.1300,1.6957,0.0000,0.0000,0.0000,0.0000,0.0000,0.0000,3.6739,0.0942,0.0000,0.0000,3.6739,0.0942,0.0000,0.0000,0.0000,0.0000,0.0000,0.0000,250.0000,6.2500,0.0000,0.0000,15.1802,0.3743,0.0000,0.0000,0.3741,0.0193,0.0000,0.0000,39.0888,2.0312,0.0000,0.0000,66.1300,0.0000,0.0000,0.0000,0.0000,0.0000,0.0000,0.0000,0.0000,0.0000,0.0000,0.0000,1.0758,0.0239,0.0000,0.0000,20.4404,0.4542,0.0000,0.0000,0.3616,0.0080,0.0000,0.0000,6.8705,0.1527,0.0000,0.0000
1869.75,289,23.0000,115.1614,32.1095,1.6900,13.2908,0.9767,0.0000,0.0000,22.2146,0.5274,0.0000,0.0000,22.2146,0.5274,0.0000,0.0000,0.0000,0.0000,0.0000,0.0000,1.2341,0.0293,0.0000,0.0000,1.2341,0.0293,0.0000,0.0000,0.0000,0.0000,0.0000,0.0000,0.0000,0.0000,0.0000,0.0000,8.9000,0.1830,0.0000,0.0000,0.1170,0.0059,0.0000,0.0000,13.2908,0.9767,0.0000,0.0000,22.2146,0.0000,0.0000,0.0000,0.0000,0.0000,0.0000,0.0000,0.0000,0.0000,0.0000,0.0000,0.9253,0.0206,0.0000,0.0000,17.5816,0.3907,0.0000,0.0000,0.3798,0.0084,0.0000,0.0000,7.2165,0.1604,0.0000,0.0000
1872.75,289,3.1000,109.6146,32.9930,1.7365,38.1097,1.9889,0.0000,0.0000,63.6976,1.6468,0.0000,0.0000,63.6976,1.6468,0.0000,0.0000,0.0000,0.0000,0.0000,0.0000,3.5388,0.0915,0.0000,0.0000,3.5388,0.0915,0.0000,0.0000,0.0000,0.0000,0.0000,0.0000,250.0000,6.2500,0.0000,0.0000,25.6364,0.9565,0.0000,0.0000,0.4032,0.0209,0.0000,0.0000,38.1097,1.9889,0.0000,0.0000,63.6976,0.0000,0.0000,0.0000,0.0000,0.0000,0.0000,0.0000,0.0000,0.0000,0.0000,0.0000,1.0533,0.0234,0.0000,0.0000,20.0131,0.4447,0.0000,0.0000,0.3375,0.0075,0.0000,0.0000,6.4129,0.1425,0.0000,0.0000
1873.75,289,3.1000,123.8933,37.0995,1.9526,43.1544,2.1817,0.0000,0.0000,72.1794,1.8073,0.0000,0.0000,72.1794,1.8073,0.0000,0.0000,0.0000,0.0000,0.0000,0.0000,4.0100,0.1004,0.0000,0.0000,4.0100,0.1004,0.0000,0.0000,0.0000,0.0000,0.0000,0.0000,250.0000,6.2500,0.0000,0.0000,23.2128,0.3764,0.0000,0.0000,0.1739,0.0090,0.0000,0.0000,43.1544,2.1817,0.0000,0.0000,72.1794,0.0000,0.0000,0.0000,0.0000,0.0000,0.0000,0.0000,0.0000,0.0000,0.0000,0.0000,1.1583,0.0257,0.0000,0.0000,22.0075,0.4891,0.0000,0.0000,0.4038,0.0090,0.0000,0.0000,7.6731,0.1705,0.0000,0.0000
1874.75,289,3.1000,130.9236,35.7099,1.8795,45.6298,2.2725,0.0000,0.0000,76.2670,1.8817,0.0000,0.0000,76.2670,1.8817,0.0000,0.0000,0.0000,0.0000,0.0000,0.0000,4.2371,0.1045,0.0000,0.0000,4.2371,0.1045,0.0000,0.0000,0.0000,0.0000,0.0000,0.0000,250.0000,6.2500,0.0000,0.0000,21.8877,0.6394,0.0000,0.0000,0.2719,0.0137,0.0000,0.0000,45.6298,2.2725,0.0000,0.0000,76.2670,0.0000,0.0000,0.0000,0.0000,0.0000,0.0000,0.0000,0.0000,0.0000,0.0000,0.0000,1.1543,0.0257,0.0000,0.0000,21.9313,0.4874,0.0000,0.0000,0.3646,0.0081,0.0000,0.0000,6.9279,0.1540,0.0000,0.0000
1875.75,289,23.0000,110.5513,32.5882,1.7152,10.0226,0.7622,0.0000,0.0000,16.7520,0.4116,0.0000,0.0000,16.7520,0.4116,0.0000,0.0000,0.0000,0.0000,0.0000,0.0000,0.9307,0.0229,0.0000,0.0000,0.9307,0.0229,0.0000,0.0000,0.0000,0.0000,0.0000,0.0000,0.0000,0.0000,0.0000,0.0000,12.7015,0.3767,0.0000,0.0000,0.1278,0.0063,0.0000,0.0000,10.0226,0.7622,0.0000,0.0000,16.7520,0.0000,0.0000,0.0000,0.0000,0.0000,0.0000,0.0000,0.0000,0.0000,0.0000,0.0000,0.8851,0.0197,0.0000,0.0000,16.8165,0.3737,0.0000,0.0000,0.4123,0.0092,0.0000,0.0000,7.8333,0.1741,0.0000,0.0000
1878.75,289,3.1000,125.4492,38.7643,2.0402,43.5847,2.1975,0.0000,0.0000,73.1044,1.8239,0.0000,0.0000,73.1044,1.8239,0.0000,0.0000,0.0000,0.0000,0.0000,0.0000,4.0614,0.1013,0.0000,0.0000,4.0614,0.1013,0.0000,0.0000,0.0000,0.0000,0.0000,0.0000,250.0000,6.2500,0.0000,0.0000,28.2932,0.7626,0.0000,0.0000,0.5433,0.0285,0.0000,0.0000,43.5847,2.1975,0.0000,0.0000,73.1044,0.0000,0.0000,0.0000,0.0000,0.0000,0.0000,0.0000,0.0000,0.0000,0.0000,0.0000,1.1677,0.0259,0.0000,0.0000,22.1857,0.4927,0.0000,0.0000,0.4062,0.0090,0.0000,0.0000,7.7169,0.1713,0.0000,0.0000
1879.75,289,3.1000,99.8552,35.9265,1.8909,33.5571,1.8209,0.0000,0.0000,59.1538,1.5631,0.0000,0.0000,59.1538,1.5631,0.0000,0.0000,0.0000,0.0000,0.0000,0.0000,3.2863,0.0868,0.0000,0.0000,3.2863,0.0868,0.0000,0.0000,0.0000,0.0000,0.0000,0.0000,250.0000,6.2500,0.0000,0.0000,29.9177,0.5798,0.0000,0.0000,0.3410,0.0179,0.0000,0.0000,33.5571,1.8209,0.0000,0.0000,59.1538,0.0000,0.0000,0.0000,0.0000,0.0000,0.0000,0.0000,0.0000,0.0000,0.0000,0.0000,1.0710,0.0238,0.0000,0.0000,20.3482,0.4519,0.0000,0.0000,0.3789,0.0084,0.0000,0.0000,7.1994,0.1598,0.0000,0.0000
1880.75,289,3.1000,115.3264,36.5118,1.9217,39.9020,2.0611,0.0000,0.0000,67.1757,1.7150,0.0000,0.0000,67.1757,1.7150,0.0000,0.0000,0.0000,0.0000,0.0000,0.0000,3.7320,0.0953,0.0000,0.0000,3.7320,0.0953,0.0000,0.0000,0.0000,0.0000,0.0000,0.0000,250.0000,6.2500,0.0000,0.0000,13.5083,0.2471,0.0000,0.0000,0.1702,0.0087,0.0000,0.0000,39.9020,2.0611,0.0000,0.0000,67.1757,0.0000,0.0000,0.0000,0.0000,0.0000,0.0000,0.0000,0.0000,0.0000,0.0000,0.0000,1.1320,0.0252,0.0000,0.0000,21.5078,0.4780,0.0000,0.0000,0.3887,0.0086,0.0000,0.0000,7.3862,0.1641,0.0000,0.0000
1881.75,289,23.0000,127.5566,35.2864,1.8572,9.2286,0.7079,0.0000,0.0000,15.4250,0.3823,0.0000,0.0000,15.4250,0.3823,0.0000,0.0000,0.0000,0.0000,0.0000,0.0000,0.8569,0.0212,0.0000,0.0000,0.8569,0.0212,0.0000,0.0000,0.0000,0.0000,0.0000,0.0000,0.0000,0.0000,0.0000,0.0000,36.7737,0.7445,0.0000,0.0000,0.4091,0.0208,0.0000,0.0000,9.2286,0.7079,0.0000,0.0000,15.4250,0.0000,0.0000,0.0000,0.0000,0.0000,0.0000,0.0000,0.0000,0.0000,0.0000,0.0000,1.0285,0.0229,0.0000,0.0000,19.5421,0.4343,0.0000,0.0000,0.4152,0.0092,0.0000,0.0000,7.8892,0.1753,0.0000,0.0000
1884.75,289,3.1000,165.9502,38.8273,2.0435,57.9047,2.6879,0.0000,0.0000,96.7836,2.2256,0.0000,0.0000,96.7836,2.2256,0.0000,0.0000,0.0000,0.0000,0.0000,0.0000,5.3769,0.1236,0.0000,0.0000,5.3769,0.1236,0.0000,0.0000,0.0000,0.0000,0.0000,0.0000,250.0000,6.2500,0.0000,0.0000,22.5513,0.5991,0.0000,0.0000,0.3156,0.0163,0.0000,0.0000,57.9047,2.6879,0.0000,0.0000,96.7836,0.0000,0.0000,0.0000,0.0000,0.0000,0.0000,0.0000,0.0000,0.0000,0.0000,0.0000,1.2371,0.0275,0.0000,0.0000,23.5058,0.5224,0.0000,0.0000,0.4128,0.0092,0.0000,0.0000,7.8428,0.1743,0.0000,0.0000
1885.75,289,3.1000,97.0501,35.4827,1.8675,32.3086,1.7711,0.0000,0.0000,57.3511,1.5275,0.0000,0.0000,57.3511,1.5275,0.0000,0.0000,0.0000,0.0000,0.0000,0.0000,3.1862,0.0849,0.0000,0.0000,3.1862,0.0849,0.0000,0.0000,0.0000,0.0000,0.0000,0.0000,250.0000,6.2500,0.0000,0.0000,30.4996,0.5705,0.0000,0.0000,0.2810,0.0145,0.0000,0.0000,32.3086,1.7711,0.0000,0.0000,57.3511,0.0000,0.0000,0.0000,0.0000,0.0000,0.0000,0.0000,0.0000,0.0000,0.0000,0.0000,1.0321,0.0229,0.0000,0.0000,19.6106,0.4356,0.0000,0.0000,0.3860,0.0086,0.0000,0.0000,7.3343,0.1629,0.0000,0.0000
1886.75,289,3.1000,128.2816,36.7760,1.9356,44.4069,2.2294,0.0000,0.0000,74.8040,1.8557,0.0000,0.0000,74.8040,1.8557,0.0000,0.0000,0.0000,0.0000,0.0000,0.0000,4.1558,0.1031,0.0000,0.0000,4.1558,0.1031,0.0000,0.0000,0.0000,0.0000,0.0000,0.0000,250.0000,6.2500,0.0000,0.0000,20.3431,0.4034,0.0000,0.0000,0.4709,0.0239,0.0000,0.0000,44.4069,2.2294,0.0000,0.0000,74.8040,0.0000,0.0000,0.0000,0.0000,0.0000,0.0000,0.0000,0.0000,0.0000,0.0000,0.0000,1.1472,0.0255,0.0000,0.0000,21.7972,0.4842,0.0000,0.0000,0.3947,0.0088,0.0000,0.0000,7.4996,0.1666,0.0000,0.0000
1887.75,289,23.0000,142.6077,33.5838,1.7676,15.0069,1.0837,0.0000,0.0000,25.0829,0.5852,0.0000,0.0000,25.0829,0.5852,0.0000,0.0000,0.0000,0.0000,0.0000,0.0000,1.3935,0.0325,0.0000,0.0000,1.3935,0.0325,0.0000,0.0000,0.0000,0.0000,0.0000,0.0000,0.0000,0.0000,0.0000,0.0000,30.4894,0.8749,0.0000,0.0000,0.7376,0.0371,0.0000,0.0000,15.0069,1.0837,0.0000,0.0000,25.0829,0.0000,0.0000,0.0000,0.0000,0.0000,0.0000,0.0000,0.0000,0.0000,0.0000,0.0000,0.9964,0.0221,0.0000,0.0000,18.9316,0.4207,0.0000,0.0000,0.3831,0.0085,0.0000,0.0000,7.2784,0.1617,0.0000,0.0000
1890.75,289,3.1000,97.8652,33.2167,1.7482,33.3364,1.8055,0.0000,0.0000,57.4305,1.5259,0.0000,0.0000,57.4305,1.5259,0.0000,0.0000,0.0000,0.0000,0.0000,0.0000,3.1906,0.0848,0.0000,0.0000,3.1906,0.0848,0.0000,0.0000,0.0000,0.0000,0.0000,0.0000,250.0000,6.2500,0.0000,0.0000,43.3171,0.8448,0.0000,0.0000,0.3395,0.0178,0.0000,0.0000,33.3364,1.8055,0.0000,0.0000,57.4305,0.0000,0.0000,0.0000,0.0000,0.0000,0.0000,0.0000,0.0000,0.0000,0.0000,0.0000,1.0184,0.0226,0.0000,0.0000,19.3495,0.4300,0.0000,0.0000,0.3608,0.0080,0.0000,0.0000,6.8560,0.1524,0.0000,0.0000
1891.75,289,3.1000,128.0167,34.4883,1.8152,44.5910,2.2344,0.0000,0.0000,74.5306,1.8501,0.0000,0.0000,74.5306,1.8501,0.0000,0.0000,0.0000,0.0000,0.0000,0.0000,4.1406,0.1028,0.0000,0.0000,4.1406,0.1028,0.0000,0.0000,0.0000,0.0000,0.0000,0.0000,250.0000,6.2500,0.0000,0.0000,30.9578,0.6662,0.0000,0.0000,0.3282,0.0167,0.0000,0.0000,44.5910,2.2344,0.0000,0.0000,74.5306,0.0000,0.0000,0.0000,0.0000,0.0000,0.0000,0.0000,0.0000,0.0000,0.0000,0.0000,1.1133,0.0247,0.0000,0.0000,21.1523,0.4700,0.0000,0.0000,0.3516,0.0078,0.0000,0.0000,6.6795,0.1484,0.0000,0.0000
1892.75,289,3.1000,126.4452,37.8620,1.9927,41.0018,2.1353,0.0000,0.0000,76.2189,1.9001,0.0000,0.0000,76.2189,1.9001,0.0000,0.0000,0.0000,0.0000,0.0000,0.0000,4.2344,0.1056,0.0000,0.0000,4.2344,0.1056,0.0000,0.0000,0.0000,0.0000,0.0000,0.0000,250.0000,6.2500,0.0000,0.0000,24.4261,0.5950,0.0000,0.0000,0.7215,0.0363,0.0000,0.0000,41.0018,2.1353,0.0000,0.0000,76.2189,0.0000,0.0000,0.0000,0.0000,0.0000,0.0000,0.0000,0.0000,0.0000,0.0000,0.0000,1.1814,0.0262,0.0000,0.0000,22.4471,0.4986,0.0000,0.0000,0.3981,0.0088,0.0000,0.0000,7.5631,0.1679,0.0000,0.0000
1893.75,289,23.0000,127.0041,32.9317,1.7333,14.0747,1.0262,0.0000,0.0000,23.5248,0.5541,0.0000,0.0000,23.5248,0.5541,0.0000,0.0000,0.0000,0.0000,0.0000,0.0000,1.3069,0.0308,0.0000,0.0000,1.3069,0.0308,0.0000,0.0000,0.0000,0.0000,0.0000,0.0000,0.0000,0.0000,0.0000,0.0000,8.2636,0.2917,0.0000,0.0000,0.1731,0.0086,0.0000,0.0000,14.0747,1.0262,0.0000,0.0000,23.5248,0.0000,0.0000,0.0000,0.0000,0.0000,0.0000,0.0000,0.0000,0.0000,0.0000,0.0000,0.9274,0.0206,0.0000,0.0000,17.6199,0.3916,0.0000,0.0000,0.3976,0.0088,0.0000,0.0000,7.5546,0.1679,0.0000,0.0000
1896.75,289,3.1000,127.3093,35.9162,1.8903,44.3321,2.2252,0.0000,0.0000,74.0979,1.8425,0.0000,0.0000,74.0979,1.8425,0.0000,0.0000,0.0000,0.0000,0.0000,0.0000,4.1166,0.1024,0.0000,0.0000,4.1166,0.1024,0.0000,0.0000,0.0000,0.0000,0.0000,0.0000,250.0000,6.2500,0.0000,0.0000,31.1260,0.9235,0.0000,0.0000,0.3124,0.0158,0.0000,0.0000,44.3321,2.2252,0.0000,0.0000,74.0979,0.0000,0.0000,0.0000,0.0000,0.0000,0.0000,0.0000,0.0000,0.0000,0.0000,0.0000,1.1539,0.0256,0.0000,0.0000,21.9247,0.4872,0.0000,0.0000,0.3692,0.0082,0.0000,0.0000,7.0153,0.1559,0.0000,0.0000
1897.75,289,3.1000,107.2972,35.8051,1.8845,37.2356,1.9509,0.0000,0.0000,62.2517,1.6156,0.0000,0.0000,62.2517,1.6156,0.0000,0.0000,0.0000,0.0000,0.0000,0.0000,3.4584,0.0898,0.0000,0.0000,3.4584,0.0898,0.0000,0.0000,0.0000,0.0000,0.0000,0.0000,250.0000,6.2500,0.0000,0.0000,38.3113,0.7523,0.0000,0.0000,0.3244,0.0163,0.0000,0.0000,37.2356,1.9509,0.0000,0.0000,62.2517,0.0000,0.0000,0.0000,0.0000,0.0000,0.0000,0.0000,0.0000,0.0000,0.0000,0.0000,1.0886,0.0241,0.0000,0.0000,20.6832,0.4588,0.0000,0.0000,0.3889,0.0086,0.0000,0.0000,7.3883,0.1637,0.0000,0.0000
1898.75,289,3.1000,115.6663,30.9752,1.6303,40.2910,2.0737,0.0000,0.0000,67.3436,1.7171,0.0000,0.0000,67.3436,1.7171,0.0000,0.0000,0.0000,0.0000,0.0000,0.0000,3.7413,0.0954,0.0000,0.0000,3.7413,0.0954,0.0000,0.0000,0.0000,0.0000,0.0000,0.0000,250.0000,6.2500,0.0000,0.0000,28.3956,0.7779,0.0000,0.0000,0.5398,0.0268,0.0000,0.0000,40.2910,2.0737,0.0000,0.0000,67.3436,0.0000,0.0000,0.0000,0.0000,0.0000,0.0000,0.0000,0.0000,0.0000,0.0000,0.0000,1.0080,0.0224,0.0000,0.0000,19.1514,0.4256,0.0000,0.0000,0.3124,0.0069,0.0000,0.0000,5.9365,0.1319,0.0000,0.0000
1899.75,289,23.0000,130.0525,33.2760,1.7514,13.1808,0.9696,0.0000,0.0000,22.0308,0.5236,0.0000,0.0000,22.0308,0.5236,0.0000,0.0000,0.0000,0.0000,0.0000,0.0000,1.2239,0.0291,0.0000,0.0000,1.2239,0.0291,0.0000,0.0000,0.0000,0.0000,0.0000,0.0000,0.0000,0.0000,0.0000,0.0000,47.1889,1.1830,0.0000,0.0000,0.5847,0.0280,0.0000,0.0000,13.1808,0.9696,0.0000,0.0000,22.0308,0.0000,0.0000,0.0000,0.0000,0.0000,0.0000,0.0000,0.0000,0.0000,0.0000,0.0000,0.9569,0.0213,0.0000,0.0000,18.1802,0.4040,0.0000,0.0000,0.3927,0.0087,0.0000,0.0000,7.4610,0.1658,0.0000,0.0000
1902.75,289,3.1000,119.9336,36.6071,1.9267,41.7633,2.1285,0.0000,0.0000,69.8043,1.7624,0.0000,0.0000,69.8043,1.7624,0.0000,0.0000,0.0000,0.0000,0.0000,0.0000,3.8780,0.0979,0.0000,0.0000,3.8780,0.0979,0.0000,0.0000,0.0000,0.0000,0.0000,0.0000,250.0000,6.2500,0.0000,0.0000,34.5069,0.8106,0.0000,0.0000,0.4245,0.0211,0.0000,0.0000,41.7633,2.1285,0.0000,0.0000,69.8043,0.0000,0.0000,0.0000,0.0000,0.0000,0.0000,0.0000,0.0000,0.0000,0.0000,0.0000,1.1246,0.0250,0.0000,0.0000,21.3669,0.4745,0.0000,0.0000,0.3720,0.0083,0.0000,0.0000,7.0680,0.1569,0.0000,0.0000
1903.75,289,3.1000,113.4333,32.7059,1.7214,39.5477,2.0450,0.0000,0.0000,66.1011,1.6932,0.0000,0.0000,66.1011,1.6932,0.0000,0.0000,0.0000,0.0000,0.0000,0.0000,3.6723,0.0941,0.0000,0.0000,3.6723,0.0941,0.0000,0.0000,0.0000,0.0000,0.0000,0.0000,250.0000,6.2500,0.0000,0.0000,32.7433,0.5798,0.0000,0.0000,0.5566,0.0280,0.0000,0.0000,39.5477,2.0450,0.0000,0.0000,66.1011,0.0000,0.0000,0.0000,0.0000,0.0000,0.0000,0.0000,0.0000,0.0000,0.0000,0.0000,1.0526,0.0234,0.0000,0.0000,19.9995,0.4444,0.0000,0.0000,0.3405,0.0076,0.0000,0.0000,6.4700,0.1438,0.0000,0.0000
1904.75,289,3.1000,130.6124,38.1342,2.0071,43.0294,2.1878,0.0000,0.0000,78.0015,1.9140,0.0000,0.0000,78.0015,1.9140,0.0000,0.0000,0.0000,0.0000,0.0000,0.0000,4.3334,0.1063,0.0000,0.0000,4.3334,0.1063,0.0000,0.0000,0.0000,0.0000,0.0000,0.0000,250.0000,6.2500,0.0000,0.0000,54.5993,1.4041,0.0000,0.0000,1.0864,0.0531,0.0000,0.0000,43.0294,2.1878,0.0000,0.0000,78.0015,0.0000,0.0000,0.0000,0.0000,0.0000,0.0000,0.0000,0.0000,0.0000,0.0000,0.0000,1.1805,0.0261,0.0000,0.0000,22.4296,0.4958,0.0000,0.0000,0.4046,0.0089,0.0000,0.0000,7.6865,0.1694,0.0000,0.0000
1905.75,289,23.0000,121.6781,34.4057,1.8108,13.3690,0.9842,0.0000,0.0000,22.5972,0.5366,0.0000,0.0000,22.5972,0.5366,0.0000,0.0000,0.0000,0.0000,0.0000,0.0000,1.2554,0.0298,0.0000,0.0000,1.2554,0.0298,0.0000,0.0000,0.0000,0.0000,0.0000,0.0000,0.0000,0.0000,0.0000,0.0000,26.2641,0.5022,0.0000,0.0000,0.2845,0.0137,0.0000,0.0000,13.3690,0.9842,0.0000,0.0000,22.5972,0.0000,0.0000,0.0000,0.0000,0.0000,0.0000,0.0000,0.0000,0.0000,0.0000,0.0000,0.9955,0.0221,0.0000,0.0000,18.9144,0.4203,0.0000,0.0000,0.4053,0.0090,0.0000,0.0000,7.7000,0.1711,0.0000,0.0000
1908.75,289,3.1000,141.7988,37.3136,1.9639,49.4686,2.4077,0.0000,0.0000,82.5655,1.9916,0.0000,0.0000,82.5655,1.9916,0.0000,0.0000,0.0000,0.0000,0.0000,0.0000,4.5870,0.1106,0.0000,0.0000,4.5870,0.1106,0.0000,0.0000,0.0000,0.0000,0.0000,0.0000,250.0000,6.2500,0.0000,0.0000,37.0765,1.4291,0.0000,0.0000,0.3459,0.0171,0.0000,0.0000,49.4686,2.4077,0.0000,0.0000,82.5655,0.0000,0.0000,0.0000,0.0000,0.0000,0.0000,0.0000,0.0000,0.0000,0.0000,0.0000,1.1882,0.0264,0.0000,0.0000,22.5757,0.5017,0.0000,0.0000,0.3925,0.0087,0.0000,0.0000,7.4583,0.1657,0.0000,0.0000
1909.75,289,3.1000,129.4035,33.3955,1.7577,45.1012,2.2533,0.0000,0.0000,75.3834,1.8657,0.0000,0.0000,75.3834,1.8657,0.0000,0.0000,0.0000,0.0000,0.0000,0.0000,4.1880,0.1037,0.0000,0.0000,4.1880,0.1037,0.0000,0.0000,0.0000,0.0000,0.0000,0.0000,250.0000,6.2500,0.0000,0.0000,23.1615,0.6909,0.0000,0.0000,0.4155,0.0209,0.0000,0.0000,45.1012,2.2533,0.0000,0.0000,75.3834,0.0000,0.0000,0.0000,0.0000,0.0000,0.0000,0.0000,0.0000,0.0000,0.0000,0.0000,1.0905,0.0242,0.0000,0.0000,20.7191,0.4604,0.0000,0.0000,0.3345,0.0074,0.0000,0.0000,6.3550,0.1412,0.0000,0.0000
1910.75,289,3.1000,109.0967,32.7564,1.7240,37.9381,1.9783,0.0000,0.0000,63.4108,1.6380,0.0000,0.0000,63.4108,1.6380,0.0000,0.0000,0.0000,0.0000,0.0000,0.0000,3.5228,0.0910,0.0000,0.0000,3.5228,0.0910,0.0000,0.0000,0.0000,0.0000,0.0000,0.0000,250.0000,6.2500,0.0000,0.0000,31.1250,0.8056,0.0000,0.0000,0.5143,0.0256,0.0000,0.0000,37.9381,1.9783,0.0000,0.0000,63.4108,0.0000,0.0000,0.0000,0.0000,0.0000,0.0000,0.0000,0.0000,0.0000,0.0000,0.0000,1.0444,0.0232,0.0000,0.0000,19.8434,0.4401,0.0000,0.0000,0.3360,0.0074,0.0000,0.0000,6.3843,0.1414,0.0000,0.0000
1911.75,289,23.0000,100.6583,31.5203,1.6590,12.0463,0.8966,0.0000,0.0000,20.1345,0.4842,0.0000,0.0000,20.1345,0.4842,0.0000,0.0000,0.0000,0.0000,0.0000,0.0000,1.1186,0.0269,0.0000,0.0000,1.1186,0.0269,0.0000,0.0000,0.0000,0.0000,0.0000,0.0000,0.0000,0.0000,0.0000,0.0000,21.4224,0.2736,0.0000,0.0000,0.1899,0.0093,0.0000,0.0000,12.0463,0.8966,0.0000,0.0000,20.1345,0.0000,0.0000,0.0000,0.0000,0.0000,0.0000,0.0000,0.0000,0.0000,0.0000,0.0000,0.8622,0.0192,0.0000,0.0000,16.3815,0.3640,0.0000,0.0000,0.3960,0.0088,0.0000,0.0000,7.5239,0.1672,0.0000,0.0000
1914.75,289,3.1000,123.5905,34.0667,1.7930,43.0735,2.1784,0.0000,0.0000,71.9943,1.8037,0.0000,0.0000,71.9943,1.8037,0.0000,0.0000,0.0000,0.0000,0.0000,0.0000,3.9997,0.1002,0.0000,0.0000,3.9997,0.1002,0.0000,0.0000,0.0000,0.0000,0.0000,0.0000,250.0000,6.2500,0.0000,0.0000,46.7671,0.9901,0.0000,0.0000,0.6591,0.0338,0.0000,0.0000,43.0735,2.1784,0.0000,0.0000,71.9943,0.0000,0.0000,0.0000,0.0000,0.0000,0.0000,0.0000,0.0000,0.0000,0.0000,0.0000,1.0999,0.0244,0.0000,0.0000,20.8989,0.4644,0.0000,0.0000,0.3530,0.0078,0.0000,0.0000,6.7075,0.1491,0.0000,0.0000
1915.75,289,3.1000,117.3786,33.8563,1.7819,40.8651,2.0955,0.0000,0.0000,68.3031,1.7350,0.0000,0.0000,68.3031,1.7350,0.0000,0.0000,0.0000,0.0000,0.0000,0.0000,3.7946,0.0964,0.0000,0.0000,3.7946,0.0964,0.0000,0.0000,0.0000,0.0000,0.0000,0.0000,250.0000,6.2500,0.0000,0.0000,39.5461,1.0877,0.0000,0.0000,0.3357,0.0168,0.0000,0.0000,40.8651,2.0955,0.0000,0.0000,68.3031,0.0000,0.0000,0.0000,0.0000,0.0000,0.0000,0.0000,0.0000,0.0000,0.0000,0.0000,1.1030,0.0245,0.0000,0.0000,20.9569,0.4656,0.0000,0.0000,0.3403,0.0076,0.0000,0.0000,6.4649,0.1436,0.0000,0.0000
1916.75,289,3.1000,124.8204,38.3533,2.0186,43.3729,2.1839,0.0000,0.0000,72.7565,1.8127,0.0000,0.0000,72.7565,1.8127,0.0000,0.0000,0.0000,0.0000,0.0000,0.0000,4.0420,0.1007,0.0000,0.0000,4.0420,0.1007,0.0000,0.0000,0.0000,0.0000,0.0000,0.0000,250.0000,6.2500,0.0000,0.0000,33.3202,0.8507,0.0000,0.0000,0.6085,0.0301,0.0000,0.0000,43.3729,2.1839,0.0000,0.0000,72.7565,0.0000,0.0000,0.0000,0.0000,0.0000,0.0000,0.0000,0.0000,0.0000,0.0000,0.0000,1.1569,0.0256,0.0000,0.0000,21.9806,0.4871,0.0000,0.0000,0.4017,0.0089,0.0000,0.0000,7.6320,0.1688,0.0000,0.0000
1917.75,289,23.0000,87.4249,29.5999,1.5579,7.9119,0.6160,0.0000,0.0000,13.2285,0.3328,0.0000,0.0000,13.2285,0.3328,0.0000,0.0000,0.0000,0.0000,0.0000,0.0000,0.7349,0.0185,0.0000,0.0000,0.7349,0.0185,0.0000,0.0000,0.0000,0.0000,0.0000,0.0000,0.0000,0.0000,0.0000,0.0000,24.9091,0.5540,0.0000,0.0000,0.1980,0.0098,0.0000,0.0000,7.9119,0.6160,0.0000,0.0000,13.2285,0.0000,0.0000,0.0000,0.0000,0.0000,0.0000,0.0000,0.0000,0.0000,0.0000,0.0000,0.8119,0.0180,0.0000,0.0000,15.4259,0.3428,0.0000,0.0000,0.3519,0.0078,0.0000,0.0000,6.6858,0.1486,0.0000,0.0000
1920.75,289,3.1000,126.0249,34.1565,1.7977,43.5312,2.1994,0.0000,0.0000,73.7103,1.8373,0.0000,0.0000,73.7103,1.8373,0.0000,0.0000,0.0000,0.0000,0.0000,0.0000,4.0950,0.1021,0.0000,0.0000,4.0950,0.1021,0.0000,0.0000,0.0000,0.0000,0.0000,0.0000,250.0000,6.2500,0.0000,0.0000,31.7333,0.6805,0.0000,0.0000,0.4011,0.0204,0.0000,0.0000,43.5312,2.1994,0.0000,0.0000,73.7103,0.0000,0.0000,0.0000,0.0000,0.0000,0.0000,0.0000,0.0000,0.0000,0.0000,0.0000,1.1003,0.0245,0.0000,0.0000,20.9066,0.4646,0.0000,0.0000,0.3532,0.0078,0.0000,0.0000,6.7107,0.1491,0.0000,0.0000
1921.75,289,3.1000,133.1397,34.8966,1.8367,46.3426,2.2969,0.0000,0.0000,77.4477,1.9017,0.0000,0.0000,77.4477,1.9017,0.0000,0.0000,0.0000,0.0000,0.0000,0.0000,4.3027,0.1056,0.0000,0.0000,4.3027,0.1056,0.0000,0.0000,0.0000,0.0000,0.0000,0.0000,250.0000,6.2500,0.0000,0.0000,32.8070,0.8559,0.0000,0.0000,0.7930,0.0399,0.0000,0.0000,46.3426,2.2969,0.0000,0.0000,77.4477,0.0000,0.0000,0.0000,0.0000,0.0000,0.0000,0.0000,0.0000,0.0000,0.0000,0.0000,1.1147,0.0248,0.0000,0.0000,21.1792,0.4705,0.0000,0.0000,0.3616,0.0080,0.0000,0.0000,6.8710,0.1526,0.0000,0.0000
1922.75,289,3.1000,166.1267,38.9032,2.0475,57.9644,2.6890,0.0000,0.0000,96.8833,2.2265,0.0000,0.0000,96.8833,2.2265,0.0000,0.0000,0.0000,0.0000,0.0000,0.0000,5.3824,0.1237,0.0000,0.0000,5.3824,0.1237,0.0000,0.0000,0.0000,0.0000,0.0000,0.0000,250.0000,6.2500,0.0000,0.0000,27.5193,0.6870,0.0000,0.0000,0.3663,0.0178,0.0000,0.0000,57.9644,2.6890,0.0000,0.0000,96.8833,0.0000,0.0000,0.0000,0.0000,0.0000,0.0000,0.0000,0.0000,0.0000,0.0000,0.0000,1.2371,0.0275,0.0000,0.0000,23.5051,0.5222,0.0000,0.0000,0.4148,0.0092,0.0000,0.0000,7.8814,0.1751,0.0000,0.0000
1923.75,289,23.0000,92.6133,32.9542,1.7344,7.5580,0.5908,0.0000,0.0000,12.6326,0.3191,0.0000,0.0000,12.6326,0.3191,0.0000,0.0000,0.0000,0.0000,0.0000,0.0000,0.7018,0.0177,0.0000,0.0000,0.7018,0.0177,0.0000,0.0000,0.0000,0.0000,0.0000,0.0000,0.0000,0.0000,0.0000,0.0000,25.9868,0.5626,0.0000,0.0000,0.2394,0.0115,0.0000,0.0000,7.5580,0.5908,0.0000,0.0000,12.6326,0.0000,0.0000,0.0000,0.0000,0.0000,0.0000,0.0000,0.0000,0.0000,0.0000,0.0000,0.8848,0.0197,0.0000,0.0000,16.8115,0.3736,0.0000,0.0000,0.4115,0.0091,0.0000,0.0000,7.8188,0.1738,0.0000,0.0000
1926.75,289,3.1000,119.0989,34.6463,1.8235,41.4665,2.1188,0.0000,0.0000,69.3083,1.7544,0.0000,0.0000,69.3083,1.7544,0.0000,0.0000,0.0000,0.0000,0.0000,0.0000,3.8505,0.0975,0.0000,0.0000,3.8505,0.0975,0.0000,0.0000,0.0000,0.0000,0.0000,0.0000,250.0000,6.2500,0.0000,0.0000,34.0796,0.3289,0.0000,0.0000,0.1531,0.0080,0.0000,0.0000,41.4665,2.1188,0.0000,0.0000,69.3083,0.0000,0.0000,0.0000,0.0000,0.0000,0.0000,0.0000,0.0000,0.0000,0.0000,0.0000,1.0997,0.0244,0.0000,0.0000,20.8944,0.4643,0.0000,0.0000,0.3474,0.0077,0.0000,0.0000,6.6008,0.1467,0.0000,0.0000
1927.75,289,3.1000,129.1210,38.7454,2.0392,44.6084,2.2403,0.0000,0.0000,75.6022,1.8726,0.0000,0.0000,75.6022,1.8726,0.0000,0.0000,0.0000,0.0000,0.0000,0.0000,4.2001,0.1040,0.0000,0.0000,4.2001,0.1040,0.0000,0.0000,0.0000,0.0000,0.0000,0.0000,250.0000,6.2500,0.0000,0.0000,32.0191,0.8359,0.0000,0.0000,0.3240,0.0169,0.0000,0.0000,44.6084,2.2403,0.0000,0.0000,75.6022,0.0000,0.0000,0.0000,0.0000,0.0000,0.0000,0.0000,0.0000,0.0000,0.0000,0.0000,1.1842,0.0263,0.0000,0.0000,22.5003,0.5000,0.0000,0.0000,0.4085,0.0091,0.0000,0.0000,7.7618,0.1725,0.0000,0.0000
1928.75,289,3.1000,97.8570,33.2782,1.7515,33.0875,1.7979,0.0000,0.0000,57.6447,1.5312,0.0000,0.0000,57.6447,1.5312,0.0000,0.0000,0.0000,0.0000,0.0000,0.0000,3.2025,0.0851,0.0000,0.0000,3.2025,0.0851,0.0000,0.0000,0.0000,0.0000,0.0000,0.0000,250.0000,6.2500,0.0000,0.0000,46.8943,0.8467,0.0000,0.0000,0.4977,0.0253,0.0000,0.0000,33.0875,1.7979,0.0000,0.0000,57.6447,0.0000,0.0000,0.0000,0.0000,0.0000,0.0000,0.0000,0.0000,0.0000,0.0000,0.0000,1.0182,0.0226,0.0000,0.0000,19.3455,0.4297,0.0000,0.0000,0.3626,0.0081,0.0000,0.0000,6.8900,0.1530,0.0000,0.0000
1929.75,289,23.0000,136.2455,35.7327,1.8807,14.8406,1.0735,0.0000,0.0000,24.8049,0.5797,0.0000,0.0000,24.8049,0.5797,0.0000,0.0000,0.0000,0.0000,0.0000,0.0000,1.3781,0.0322,0.0000,0.0000,1.3781,0.0322,0.0000,0.0000,0.0000,0.0000,0.0000,0.0000,0.0000,0.0000,0.0000,0.0000,25.0654,0.6188,0.0000,0.0000,0.2879,0.0140,0.0000,0.0000,14.8406,1.0735,0.0000,0.0000,24.8049,0.0000,0.0000,0.0000,0.0000,0.0000,0.0000,0.0000,0.0000,0.0000,0.0000,0.0000,1.0298,0.0229,0.0000,0.0000,19.5658,0.4348,0.0000,0.0000,0.4216,0.0094,0.0000,0.0000,8.0100,0.1780,0.0000,0.0000
1932.75,289,3.1000,70.4189,27.5562,1.4503,23.1977,1.3670,0.0000,0.0000,41.8730,1.1925,0.0000,0.0000,41.8730,1.1925,0.0000,0.0000,0.0000,0.0000,0.0000,0.0000,2.3263,0.0662,0.0000,0.0000,2.3263,0.0662,0.0000,0.0000,0.0000,0.0000,0.0000,0.0000,250.0000,6.2500,0.0000,0.0000,17.7129,0.2035,0.0000,0.0000,0.0165,0.0007,0.0000,0.0000,23.1977,1.3670,0.0000,0.0000,41.8730,0.0000,0.0000,0.0000,0.0000,0.0000,0.0000,0.0000,0.0000,0.0000,0.0000,0.0000,0.7934,0.0176,0.0000,0.0000,15.0745,0.3350,0.0000,0.0000,0.2905,0.0065,0.0000,0.0000,5.5198,0.1227,0.0000,0.0000
1933.75,289,3.1000,113.6486,34.6949,1.8261,39.4993,2.0424,0.0000,0.0000,66.0202,1.6911,0.0000,0.0000,66.0202,1.6911,0.0000,0.0000,0.0000,0.0000,0.0000,0.0000,3.6678,0.0940,0.0000,0.0000,3.6678,0.0940,0.0000,0.0000,0.0000,0.0000,0.0000,0.0000,250.0000,6.2500,0.0000,0.0000,38.0021,1.0259,0.0000,0.0000,0.6575,0.0356,0.0000,0.0000,39.4993,2.0424,0.0000,0.0000,66.0202,0.0000,0.0000,0.0000,0.0000,0.0000,0.0000,0.0000,0.0000,0.0000,0.0000,0.0000,1.0957,0.0243,0.0000,0.0000,20.8191,0.4625,0.0000,0.0000,0.3639,0.0081,0.0000,0.0000,6.9133,0.1536,0.0000,0.0000
1934.75,289,3.1000,127.2586,35.9360,1.8914,44.3153,2.2246,0.0000,0.0000,74.0699,1.8420,0.0000,0.0000,74.0699,1.8420,0.0000,0.0000,0.0000,0.0000,0.0000,0.0000,4.1150,0.1023,0.0000,0.0000,4.1150,0.1023,0.0000,0.0000,0.0000,0.0000,0.0000,0.0000,250.0000,6.2500,0.0000,0.0000,36.0237,0.9391,0.0000,0.0000,0.4632,0.0240,0.0000,0.0000,44.3153,2.2246,0.0000,0.0000,74.0699,0.0000,0.0000,0.0000,0.0000,0.0000,0.0000,0.0000,0.0000,0.0000,0.0000,0.0000,1.1523,0.0256,0.0000,0.0000,21.8946,0.4865,0.0000,0.0000,0.3706,0.0082,0.0000,0.0000,7.0406,0.1565,0.0000,0.0000
1935.75,289,23.0000,86.1982,28.7769,1.5146,8.6163,0.6655,0.0000,0.0000,14.4025,0.3594,0.0000,0.0000,14.4025,0.3594,0.0000,0.0000,0.0000,0.0000,0.0000,0.0000,0.8001,0.0200,0.0000,0.0000,0.8001,0.0200,0.0000,0.0000,0.0000,0.0000,0.0000,0.0000,0.0000,0.0000,0.0000,0.0000,33.6819,0.7231,0.0000,0.0000,0.3001,0.0152,0.0000,0.0000,8.6163,0.6655,0.0000,0.0000,14.4025,0.0000,0.0000,0.0000,0.0000,0.0000,0.0000,0.0000,0.0000,0.0000,0.0000,0.0000,0.7764,0.0173,0.0000,0.0000,14.7523,0.3278,0.0000,0.0000,0.3639,0.0081,0.0000,0.0000,6.9149,0.1537,0.0000,0.0000
1938.75,289,3.1000,95.0740,33.5454,1.7655,33.0192,1.7825,0.0000,0.0000,55.1893,1.4759,0.0000,0.0000,55.1893,1.4759,0.0000,0.0000,0.0000,0.0000,0.0000,0.0000,3.0661,0.0820,0.0000,0.0000,3.0661,0.0820,0.0000,0.0000,0.0000,0.0000,0.0000,0.0000,250.0000,6.2500,0.0000,0.0000,24.0834,0.4495,0.0000,0.0000,0.0785,0.0036,0.0000,0.0000,33.0192,1.7825,0.0000,0.0000,55.1893,0.0000,0.0000,0.0000,0.0000,0.0000,0.0000,0.0000,0.0000,0.0000,0.0000,0.0000,1.0364,0.0230,0.0000,0.0000,19.6907,0.4376,0.0000,0.0000,0.3590,0.0080,0.0000,0.0000,6.8208,0.1516,0.0000,0.0000
1939.75,293,3.3000,226.1449,58.8870,3.0993,90.0413,4.9442,0.0000,0.0000,121.5558,1.2459,0.0000,0.0000,121.5558,1.2459,0.0000,0.0000,0.0000,0.0000,0.0000,0.0000,6.7531,0.0692,0.0000,0.0000,6.7531,0.0692,0.0000,0.0000,0.0000,4.0000,0.0000,0.0000,0.0000,0.0000,0.0000,0.0000,22.6236,0.3828,0.0000,0.0000,0.5571,0.0309,0.0000,0.0000,90.0413,4.9442,0.0000,0.0000,121.5558,0.0000,0.0000,0.0000,0.0000,0.0000,0.0000,0.0000,0.0000,0.0000,0.0000,0.0000,1.8729,0.0416,0.0000,0.0000,35.5842,0.7908,0.0000,0.0000,0.5909,0.0131,0.0000,0.0000,11.2277,0.2495,0.0000,0.0000
1940.75,293,3.3000,216.3074,64.4472,3.3920,85.6828,4.7971,0.0000,0.0000,117.2504,1.2315,0.0000,0.0000,117.2504,1.2315,0.0000,0.0000,0.0000,0.0000,0.0000,0.0000,6.5139,0.0684,0.0000,0.0000,6.5139,0.0684,0.0000,0.0000,0.0000,4.0000,0.0000,0.0000,0.0000,0.0000,0.0000,0.0000,35.0715,0.8643,0.0000,0.0000,0.5004,0.0285,0.0000,0.0000,85.6828,4.7971,0.0000,0.0000,117.2504,0.0000,0.0000,0.0000,0.0000,0.0000,0.0000,0.0000,0.0000,0.0000,0.0000,0.0000,1.9679,0.0437,0.0000,0.0000,37.3897,0.8309,0.0000,0.0000,0.6182,0.0137,0.0000,0.0000,11.7454,0.2610,0.0000,0.0000
1941.75,300,19.0000,100.3691,41.5525,2.1870,0.0992,0.0000,0.0000,0.0000,4.3746,0.4359,0.0000,0.0000,4.3746,0.4359,0.0000,0.0000,0.0000,0.0000,0.0000,0.0000,0.2430,0.0242,0.0000,0.0000,0.2430,0.0242,0.0000,0.0000,0.0000,0.0000,0.0000,0.0000,250.0000,6.2500,0.0000,0.0000,26.6789,0.7211,0.0000,0.0000,0.2611,0.0132,0.0000,0.0000,0.0992,0.0000,0.0000,0.0000,4.3746,0.0000,0.0000,0.0000,0.0000,0.0000,0.0000,0.0000,0.0000,0.0000,0.0000,0.0000,1.3512,0.0795,0.0000,0.0000,25.6736,1.5102,0.0000,0.0000,0.4221,0.0248,0.0000,0.0000,8.0198,0.4718,0.0000,0.0000
1942.75,293,3.3000,258.7614,73.6642,3.8771,93.0797,5.1134,0.0000,0.0000,148.5882,1.6027,0.0000,0.0000,148.5882,1.6027,0.0000,0.0000,0.0000,0.0000,0.0000,0.0000,8.2549,0.0890,0.0000,0.0000,8.2549,0.0890,0.0000,0.0000,0.0000,4.0000,0.0000,0.0000,0.0000,0.0000,0.0000,0.0000,49.9178,2.4624,0.0000,0.0000,0.7035,0.0439,0.0000,0.0000,93.0797,5.1134,0.0000,0.0000,148.5882,0.0000,0.0000,0.0000,0.0000,0.0000,0.0000,0.0000,0.0000,0.0000,0.0000,0.0000,2.2884,0.0509,0.0000,0.0000,43.4797,0.9662,0.0000,0.0000,0.7496,0.0167,0.0000,0.0000,14.2421,0.3165,0.0000,0.0000
1943.75,293,3.3000,218.5692,70.6121,3.7164,83.3030,4.7356,0.0000,0.0000,121.3523,1.3213,0.0000,0.0000,121.3523,1.3213,0.0000,0.0000,0.0000,0.0000,0.0000,0.0000,6.7418,0.0734,0.0000,0.0000,6.7418,0.0734,0.0000,0.0000,0.0000,4.0000,0.0000,0.0000,0.0000,0.0000,0.0000,0.0000,27.6043,1.0342,0.0000,0.0000,0.2554,0.0150,0.0000,0.0000,83.3030,4.7356,0.0000,0.0000,121.3523,0.0000,0.0000,0.0000,0.0000,0.0000,0.0000,0.0000,0.0000,0.0000,0.0000,0.0000,2.1639,0.0481,0.0000,0.0000,41.1137,0.9136,0.0000,0.0000,0.7058,0.0157,0.0000,0.0000,13.4099,0.2980,0.0000,0.0000
1944.75,300,19.0000,118.0377,45.5642,2.3981,0.0876,0.0000,0.0000,0.0000,3.8614,0.4013,0.0000,0.0000,3.8614,0.4013,0.0000,0.0000,0.0000,0.0000,0.0000,0.0000,0.2145,0.0223,0.0000,0.0000,0.2145,0.0223,0.0000,0.0000,0.0000,0.0000,0.0000,0.0000,250.0000,6.2500,0.0000,0.0000,7.6755,0.4350,0.0000,0.0000,0.2211,0.0116,0.0000,0.0000,0.0876,0.0000,0.0000,0.0000,3.8614,0.0000,0.0000,0.0000,0.0000,0.0000,0.0000,0.0000,0.0000,0.0000,0.0000,0.0000,1.4259,0.0839,0.0000,0.0000,27.0914,1.5936,0.0000,0.0000,0.4878,0.0287,0.0000,0.0000,9.2682,0.5452,0.0000,0.0000
1945.75,293,3.3000,223.7960,61.5944,3.2418,89.4291,4.9220,0.0000,0.0000,120.5678,1.2381,0.0000,0.0000,120.5678,1.2381,0.0000,0.0000,0.0000,0.0000,0.0000,0.0000,6.6982,0.0688,0.0000,0.0000,6.6982,0.0688,0.0000,0.0000,0.0000,4.0000,0.0000,0.0000,0.0000,0.0000,0.0000,0.0000,12.4153,0.5649,0.0000,0.0000,0.0893,0.0059,0.0000,0.0000,89.4291,4.9220,0.0000,0.0000,120.5678,0.0000,0.0000,0.0000,0.0000,0.0000,0.0000,0.0000,0.0000,0.0000,0.0000,0.0000,1.9988,0.0444,0.0000,0.0000,37.9779,0.8440,0.0000,0.0000,0.6074,0.0135,0.0000,0.0000,11.5400,0.2564,0.0000,0.0000
1946.75,293,3.3000,257.9135,64.8477,3.4130,103.5755,5.3925,0.0000,0.0000,138.5632,1.3420,0.0000,0.0000,138.5632,1.3420,0.0000,0.0000,0.0000,0.0000,0.0000,0.0000,7.6980,0.0746,0.0000,0.0000,7.6980,0.0746,0.0000,0.0000,0.0000,4.0000,0.0000,0.0000,0.0000,0.0000,0.0000,0.0000,37.6464,2.8283,0.0000,0.0000,0.4308,0.0279,0.0000,0.0000,103.5755,5.3925,0.0000,0.0000,138.5632,0.0000,0.0000,0.0000,0.0000,0.0000,0.0000,0.0000,0.0000,0.0000,0.0000,0.0000,2.0902,0.0464,0.0000,0.0000,39.7145,0.8825,0.0000,0.0000,0.6557,0.0146,0.0000,0.0000,12.4575,0.2768,0.0000,0.0000
1947.75,300,19.0000,119.0103,45.6347,2.4018,0.0679,0.0000,0.0000,0.0000,2.9924,0.2991,0.0000,0.0000,2.9924,0.2991,0.0000,0.0000,0.0000,0.0000,0.0000,0.0000,0.1662,0.0166,0.0000,0.0000,0.1662,0.0166,0.0000,0.0000,0.0000,0.0000,0.0000,0.0000,250.0000,6.2500,0.0000,0.0000,21.3627,1.3814,0.0000,0.0000,0.3462,0.0178,0.0000,0.0000,0.0679,0.0000,0.0000,0.0000,2.9924,0.0000,0.0000,0.0000,0.0000,0.0000,0.0000,0.0000,0.0000,0.0000,0.0000,0.0000,1.4571,0.0857,0.0000,0.0000,27.6853,1.6285,0.0000,0.0000,0.4713,0.0277,0.0000,0.0000,8.9554,0.5268,0.0000,0.0000
1948.75,293,3.3000,226.8914,66.0769,3.4777,90.4620,4.9579,0.0000,0.0000,122.1237,1.2494,0.0000,0.0000,122.1237,1.2494,0.0000,0.0000,0.0000,0.0000,0.0000,0.0000,6.7846,0.0694,0.0000,0.0000,6.7846,0.0694,0.0000,0.0000,0.0000,4.0000,0.0000,0.0000,0.0000,0.0000,0.0000,0.0000,26.9507,1.9296,0.0000,0.0000,0.3664,0.0233,0.0000,0.0000,90.4620,4.9579,0.0000,0.0000,122.1237,0.0000,0.0000,0.0000,0.0000,0.0000,0.0000,0.0000,0.0000,0.0000,0.0000,0.0000,2.1055,0.0468,0.0000,0.0000,40.0044,0.8890,0.0000,0.0000,0.6299,0.0140,0.0000,0.0000,11.9688,0.2660,0.0000,0.0000
1949.75,293,3.3000,220.7218,65.7725,3.4617,87.9853,4.8716,0.0000,0.0000,118.8210,1.2282,0.0000,0.0000,118.8210,1.2282,0.0000,0.0000,0.0000,0.0000,0.0000,0.0000,6.6012,0.0682,0.0000,0.0000,6.6012,0.0682,0.0000,0.0000,0.0000,4.0000,0.0000,0.0000,0.0000,0.0000,0.0000,0.0000,22.1347,0.7063,0.0000,0.0000,0.1214,0.0075,0.0000,0.0000,87.9853,4.8716,0.0000,0.0000,118.8210,0.0000,0.0000,0.0000,0.0000,0.0000,0.0000,0.0000,0.0000,0.0000,0.0000,0.0000,2.0194,0.0449,0.0000,0.0000,38.3681,0.8526,0.0000,0.0000,0.6834,0.0152,0.0000,0.0000,12.9852,0.2886,0.0000,0.0000
1950.75,300,19.0000,110.6431,43.8641,2.3086,0.0668,0.0000,0.0000,0.0000,2.9449,0.2936,0.0000,0.0000,2.9449,0.2936,0.0000,0.0000,0.0000,0.0000,0.0000,0.0000,0.1636,0.0163,0.0000,0.0000,0.1636,0.0163,0.0000,0.0000,0.0000,0.0000,0.0000,0.0000,250.0000,6.2500,0.0000,0.0000,16.3880,1.0581,0.0000,0.0000,0.2077,0.0111,0.0000,0.0000,0.0668,0.0000,0.0000,0.0000,2.9449,0.0000,0.0000,0.0000,0.0000,0.0000,0.0000,0.0000,0.0000,0.0000,0.0000,0.0000,1.3696,0.0806,0.0000,0.0000,26.0232,1.5308,0.0000,0.0000,0.4655,0.0274,0.0000,0.0000,8.8453,0.5203,0.0000,0.0000
1951.75,293,3.5000,370.9792,104.6892,5.5100,184.4613,8.4742,0.0000,0.0000,0.0000,0.0000,0.0000,0.0000,0.0000,0.0000,0.0000,0.0000,0.0000,0.0000,0.0000,0.0000,92.6457,1.1925,0.0000,0.0000,92.6457,1.1925,0.0000,0.0000,0.0000,5.8400,0.0000,0.0000,0.0000,0.0000,0.0000,0.0000,12.9688,0.8005,0.0000,0.0000,0.0850,0.0050,0.0000,0.0000,184.4613,8.4742,0.0000,0.0000,0.0000,0.0000,0.0000,0.0000,0.0000,0.0000,0.0000,0.0000,0.0000,0.0000,0.0000,0.0000,3.2148,0.0714,0.0000,0.0000,61.0817,1.3571,0.0000,0.0000,1.0462,0.0232,0.0000,0.0000,19.8778,0.4416,0.0000,0.0000
1952.75,283,60.0000,132.8717,51.3698,2.7037,47.9548,7.2843,0.0000,0.0000,0.0000,0.0000,0.0000,0.0000,0.0000,0.0000,0.0000,0.0000,0.0000,0.0000,0.0000,0.0000,42.1819,1.6307,0.0000,0.0000,42.1819,1.6307,0.0000,0.0000,0.0000,0.0000,0.0000,0.0000,0.0000,0.0000,0.0000,0.0000,53.8604,2.0503,0.0000,0.0000,0.5421,0.0300,0.0000,0.0000,47.9548,7.2843,0.0000,0.0000,0.0000,0.0000,0.0000,0.0000,0.0000,0.0000,0.0000,0.0000,0.0000,0.0000,0.0000,0.0000,1.6689,0.0676,0.0000,0.0000,31.7100,1.2841,0.0000,0.0000,0.5139,0.0209,0.0000,0.0000,9.7637,0.3977,0.0000,0.0000
1953.75,293,3.5000,307.1710,92.3949,4.8629,153.3552,7.3820,0.0000,0.0000,0.0000,0.0000,0.0000,0.0000,0.0000,0.0000,0.0000,0.0000,0.0000,0.0000,0.0000,0.0000,76.6776,1.0335,0.0000,0.0000,76.6776,1.0335,0.0000,0.0000,0.0000,5.8400,0.0000,0.0000,0.0000,0.0000,0.0000,0.0000,33.4791,1.3902,0.0000,0.0000,0.3451,0.0178,0.0000,0.0000,153.3552,7.3820,0.0000,0.0000,0.0000,0.0000,0.0000,0.0000,0.0000,0.0000,0.0000,0.0000,0.0000,0.0000,0.0000,0.0000,3.1641,0.0684,0.0000,0.0000,60.1184,1.3001,0.0000,0.0000,0.8340,0.0183,0.0000,0.0000,15.8452,0.3469,0.0000,0.0000
1954.75,283,60.0000,133.1112,55.4042,2.9160,48.9349,7.4277,0.0000,0.0000,0.0000,0.0000,0.0000,0.0000,0.0000,0.0000,0.0000,0.0000,0.0000,0.0000,0.0000,0.0000,41.7777,1.6122,0.0000,0.0000,41.7777,1.6122,0.0000,0.0000,0.0000,0.0000,0.0000,0.0000,0.0000,0.0000,0.0000,0.0000,32.4956,1.1088,0.0000,0.0000,0.5192,0.0260,0.0000,0.0000,48.9349,7.4277,0.0000,0.0000,0.0000,0.0000,0.0000,0.0000,0.0000,0.0000,0.0000,0.0000,0.0000,0.0000,0.0000,0.0000,1.6857,0.0684,0.0000,0.0000,32.0282,1.2990,0.0000,0.0000,0.5695,0.0232,0.0000,0.0000,10.8204,0.4411,0.0000,0.0000
1955.75,293,3.5000,236.0904,92.3782,4.8620,108.3740,6.1898,0.0000,0.0000,0.0000,0.0000,0.0000,0.0000,0.0000,0.0000,0.0000,0.0000,0.0000,0.0000,0.0000,0.0000,63.3641,1.0309,0.0000,0.0000,63.3641,1.0309,0.0000,0.0000,0.0000,5.8400,0.0000,0.0000,0.0000,0.0000,0.0000,0.0000,29.7004,0.6989,0.0000,0.0000,0.2614,0.0132,0.0000,0.0000,108.3740,6.1898,0.0000,0.0000,0.0000,0.0000,0.0000,0.0000,0.0000,0.0000,0.0000,0.0000,0.0000,0.0000,0.0000,0.0000,2.7112,0.0584,0.0000,0.0000,51.5135,1.1102,0.0000,0.0000,0.9241,0.0201,0.0000,0.0000,17.5586,0.3824,0.0000,0.0000
1956.75,283,60.0000,119.6130,45.7460,2.4077,43.6126,6.6767,0.0000,0.0000,0.0000,0.0000,0.0000,0.0000,0.0000,0.0000,0.0000,0.0000,0.0000,0.0000,0.0000,0.0000,37.5771,1.4631,0.0000,0.0000,37.5771,1.4631,0.0000,0.0000,0.0000,0.0000,0.0000,0.0000,0.0000,0.0000,0.0000,0.0000,16.7094,0.3956,0.0000,0.0000,0.1663,0.0082,0.0000,0.0000,43.6126,6.6767,0.0000,0.0000,0.0000,0.0000,0.0000,0.0000,0.0000,0.0000,0.0000,0.0000,0.0000,0.0000,0.0000,0.0000,1.4433,0.0589,0.0000,0.0000,27.4227,1.1200,0.0000,0.0000,0.4678,0.0193,0.0000,0.0000,8.8878,0.3660,0.0000,0.0000
1957.75,293,3.5000,249.3420,87.9718,4.6301,100.3588,5.8616,0.0000,0.0000,0.0000,0.0000,0.0000,0.0000,0.0000,0.0000,0.0000,0.0000,0.0000,0.0000,0.0000,0.0000,74.0432,1.2429,0.0000,0.0000,74.0432,1.2429,0.0000,0.0000,0.0000,5.8400,0.0000,0.0000,0.0000,0.0000,0.0000,0.0000,38.8578,0.8964,0.0000,0.0000,0.3425,0.0169,0.0000,0.0000,100.3588,5.8616,0.0000,0.0000,0.0000,0.0000,0.0000,0.0000,0.0000,0.0000,0.0000,0.0000,0.0000,0.0000,0.0000,0.0000,2.6458,0.0563,0.0000,0.0000,50.2710,1.0690,0.0000,0.0000,0.8714,0.0188,0.0000,0.0000,16.5571,0.3576,0.0000,0.0000
1958.75,283,60.0000,142.7007,52.6468,2.7709,51.9955,7.5717,0.0000,0.0000,0.0000,0.0000,0.0000,0.0000,0.0000,0.0000,0.0000,0.0000,0.0000,0.0000,0.0000,0.0000,44.9524,1.6651,0.0000,0.0000,44.9524,1.6651,0.0000,0.0000,0.0000,0.0000,0.0000,0.0000,0.0000,0.0000,0.0000,0.0000,34.6664,0.6948,0.0000,0.0000,0.3798,0.0184,0.0000,0.0000,51.9955,7.5717,0.0000,0.0000,0.0000,0.0000,0.0000,0.0000,0.0000,0.0000,0.0000,0.0000,0.0000,0.0000,0.0000,0.0000,1.7392,0.0701,0.0000,0.0000,33.0455,1.3314,0.0000,0.0000,0.5138,0.0208,0.0000,0.0000,9.7614,0.3960,0.0000,0.0000
1959.75,293,3.5000,301.0761,95.4936,5.0260,150.7245,6.9287,0.0000,0.0000,0.0000,0.0000,0.0000,0.0000,0.0000,0.0000,0.0000,0.0000,0.0000,0.0000,0.0000,0.0000,74.7535,0.9611,0.0000,0.0000,74.7535,0.9611,0.0000,0.0000,0.0000,5.8400,0.0000,0.0000,0.0000,0.0000,0.0000,0.0000,25.9973,0.6899,0.0000,0.0000,0.3424,0.0175,0.0000,0.0000,150.7245,6.9287,0.0000,0.0000,0.0000,0.0000,0.0000,0.0000,0.0000,0.0000,0.0000,0.0000,0.0000,0.0000,0.0000,0.0000,3.1700,0.0664,0.0000,0.0000,60.2296,1.2608,0.0000,0.0000,0.9271,0.0198,0.0000,0.0000,17.6158,0.3762,0.0000,0.0000
1960.75,283,60.0000,185.7399,61.5733,3.2407,68.4571,9.3901,0.0000,0.0000,0.0000,0.0000,0.0000,0.0000,0.0000,0.0000,0.0000,0.0000,0.0000,0.0000,0.0000,0.0000,58.2810,2.0322,0.0000,0.0000,58.2810,2.0322,0.0000,0.0000,0.0000,0.0000,0.0000,0.0000,0.0000,0.0000,0.0000,0.0000,26.6580,0.6525,0.0000,0.0000,0.3433,0.0162,0.0000,0.0000,68.4571,9.3901,0.0000,0.0000,0.0000,0.0000,0.0000,0.0000,0.0000,0.0000,0.0000,0.0000,0.0000,0.0000,0.0000,0.0000,2.0174,0.0808,0.0000,0.0000,38.3302,1.5344,0.0000,0.0000,0.6229,0.0252,0.0000,0.0000,11.8349,0.4784,0.0000,0.0000
1961.75,293,3.5000,240.7259,91.6979,4.8262,111.0431,6.3969,0.0000,0.0000,0.0000,0.0000,0.0000,0.0000,0.0000,0.0000,0.0000,0.0000,0.0000,0.0000,0.0000,0.0000,64.4435,1.0569,0.0000,0.0000,64.4435,1.0569,0.0000,0.0000,0.0000,5.8400,0.0000,0.0000,0.0000,0.0000,0.0000,0.0000,27.8191,0.5336,0.0000,0.0000,0.2878,0.0140,0.0000,0.0000,111.0431,6.3969,0.0000,0.0000,0.0000,0.0000,0.0000,0.0000,0.0000,0.0000,0.0000,0.0000,0.0000,0.0000,0.0000,0.0000,2.7162,0.0590,0.0000,0.0000,51.6078,1.1219,0.0000,0.0000,0.9247,0.0203,0.0000,0.0000,17.5693,0.3863,0.0000,0.0000
1962.75,283,60.0000,132.4370,49.1034,2.5844,48.3904,7.0336,0.0000,0.0000,0.0000,0.0000,0.0000,0.0000,0.0000,0.0000,0.0000,0.0000,0.0000,0.0000,0.0000,0.0000,41.6366,1.5391,0.0000,0.0000,41.6366,1.5391,0.0000,0.0000,0.0000,0.0000,0.0000,0.0000,0.0000,0.0000,0.0000,0.0000,20.5966,0.4233,0.0000,0.0000,0.3276,0.0158,0.0000,0.0000,48.3904,7.0336,0.0000,0.0000,0.0000,0.0000,0.0000,0.0000,0.0000,0.0000,0.0000,0.0000,0.0000,0.0000,0.0000,0.0000,1.5521,0.0628,0.0000,0.0000,29.4894,1.1931,0.0000,0.0000,0.5081,0.0207,0.0000,0.0000,9.6547,0.3938,0.0000,0.0000
1963.75,293,3.5000,307.7358,95.6815,5.0359,153.6273,6.9960,0.0000,0.0000,0.0000,0.0000,0.0000,0.0000,0.0000,0.0000,0.0000,0.0000,0.0000,0.0000,0.0000,0.0000,76.8137,0.9794,0.0000,0.0000,76.8137,0.9794,0.0000,0.0000,0.0000,5.8400,0.0000,0.0000,0.0000,0.0000,0.0000,0.0000,30.6431,0.8219,0.0000,0.0000,0.5128,0.0253,0.0000,0.0000,153.6273,6.9960,0.0000,0.0000,0.0000,0.0000,0.0000,0.0000,0.0000,0.0000,0.0000,0.0000,0.0000,0.0000,0.0000,0.0000,3.2224,0.0674,0.0000,0.0000,61.2248,1.2803,0.0000,0.0000,0.9045,0.0193,0.0000,0.0000,17.1846,0.3670,0.0000,0.0000
1964.75,283,60.0000,123.9080,49.1756,2.5882,44.4334,6.5494,0.0000,0.0000,0.0000,0.0000,0.0000,0.0000,0.0000,0.0000,0.0000,0.0000,0.0000,0.0000,0.0000,0.0000,39.4781,1.4814,0.0000,0.0000,39.4781,1.4814,0.0000,0.0000,0.0000,0.0000,0.0000,0.0000,0.0000,0.0000,0.0000,0.0000,39.2204,0.4292,0.0000,0.0000,0.2222,0.0105,0.0000,0.0000,44.4334,6.5494,0.0000,0.0000,0.0000,0.0000,0.0000,0.0000,0.0000,0.0000,0.0000,0.0000,0.0000,0.0000,0.0000,0.0000,1.5572,0.0627,0.0000,0.0000,29.5863,1.1912,0.0000,0.0000,0.4774,0.0193,0.0000,0.0000,9.0704,0.3674,0.0000,0.0000
1965.75,293,3.5000,245.9939,87.6926,4.6154,121.8875,6.2434,0.0000,0.0000,0.0000,0.0000,0.0000,0.0000,0.0000,0.0000,0.0000,0.0000,0.0000,0.0000,0.0000,0.0000,61.9320,0.8902,0.0000,0.0000,61.9320,0.8902,0.0000,0.0000,0.0000,5.8400,0.0000,0.0000,0.0000,0.0000,0.0000,0.0000,26.9494,0.6545,0.0000,0.0000,0.3198,0.0150,0.0000,0.0000,121.8875,6.2434,0.0000,0.0000,0.0000,0.0000,0.0000,0.0000,0.0000,0.0000,0.0000,0.0000,0.0000,0.0000,0.0000,0.0000,2.5589,0.0534,0.0000,0.0000,48.6200,1.0138,0.0000,0.0000,0.9148,0.0195,0.0000,0.0000,17.3818,0.3706,0.0000,0.0000
1966.75,293,3.6000,282.4968,90.3114,4.7532,163.2262,7.0647,0.0000,0.0000,0.0000,0.0000,0.0000,0.0000,0.0000,0.0000,0.0000,0.0000,0.0000,0.0000,0.0000,0.0000,59.4397,1.0719,0.0000,0.0000,59.4397,1.0719,0.0000,0.0000,0.0000,13.7600,0.0000,0.0000,0.0000,0.0000,0.0000,0.0000,43.7885,0.5571,0.0000,0.0000,0.2116,0.0102,0.0000,0.0000,163.2262,7.0647,0.0000,0.0000,0.0000,0.0000,0.0000,0.0000,0.0000,0.0000,0.0000,0.0000,0.0000,0.0000,0.0000,0.0000,2.8840,0.0630,0.0000,0.0000,54.7966,1.1975,0.0000,0.0000,0.8737,0.0189,0.0000,0.0000,16.6003,0.3594,0.0000,0.0000
1967.75,283,60.0000,136.9538,50.4043,2.6529,50.2356,7.5600,0.0000,0.0000,0.0000,0.0000,0.0000,0.0000,0.0000,0.0000,0.0000,0.0000,0.0000,0.0000,0.0000,0.0000,43.0413,1.6470,0.0000,0.0000,43.0413,1.6470,0.0000,0.0000,0.0000,0.0000,0.0000,0.0000,0.0000,0.0000,0.0000,0.0000,33.0603,0.4792,0.0000,0.0000,0.2878,0.0151,0.0000,0.0000,50.2356,7.5600,0.0000,0.0000,0.0000,0.0000,0.0000,0.0000,0.0000,0.0000,0.0000,0.0000,0.0000,0.0000,0.0000,0.0000,1.6101,0.0654,0.0000,0.0000,30.5911,1.2430,0.0000,0.0000,0.4852,0.0199,0.0000,0.0000,9.2195,0.3777,0.0000,0.0000
1968.75,293,3.6000,392.2089,117.4717,6.1827,207.6458,8.1666,0.0000,0.0000,0.0000,0.0000,0.0000,0.0000,0.0000,0.0000,0.0000,0.0000,0.0000,0.0000,0.0000,0.0000,91.7780,1.4736,0.0000,0.0000,91.7780,1.4736,0.0000,0.0000,0.0000,13.7600,0.0000,0.0000,0.0000,0.0000,0.0000,0.0000,17.8432,0.3104,0.0000,0.0000,0.2552,0.0140,0.0000,0.0000,207.6458,8.1666,0.0000,0.0000,0.0000,0.0000,0.0000,0.0000,0.0000,0.0000,0.0000,0.0000,0.0000,0.0000,0.0000,0.0000,3.7228,0.0824,0.0000,0.0000,70.7325,1.5654,0.0000,0.0000,1.1420,0.0252,0.0000,0.0000,21.6987,0.4794,0.0000,0.0000
1969.75,283,60.0000,150.9212,55.9019,2.9422,55.5310,8.1837,0.0000,0.0000,0.0000,0.0000,0.0000,0.0000,0.0000,0.0000,0.0000,0.0000,0.0000,0.0000,0.0000,0.0000,47.2764,1.7711,0.0000,0.0000,47.2764,1.7711,0.0000,0.0000,0.0000,0.0000,0.0000,0.0000,0.0000,0.0000,0.0000,0.0000,17.1681,0.4987,0.0000,0.0000,0.3087,0.0165,0.0000,0.0000,55.5310,8.1837,0.0000,0.0000,0.0000,0.0000,0.0000,0.0000,0.0000,0.0000,0.0000,0.0000,0.0000,0.0000,0.0000,0.0000,1.7952,0.0727,0.0000,0.0000,34.1087,1.3807,0.0000,0.0000,0.5494,0.0224,0.0000,0.0000,10.4378,0.4262,0.0000,0.0000
1970.75,293,3.6000,241.9220,89.4789,4.7094,132.9470,6.6094,0.0000,0.0000,0.0000,0.0000,0.0000,0.0000,0.0000,0.0000,0.0000,0.0000,0.0000,0.0000,0.0000,0.0000,54.0428,1.1071,0.0000,0.0000,54.0428,1.1071,0.0000,0.0000,0.0000,13.7600,0.0000,0.0000,0.0000,0.0000,0.0000,0.0000,18.4680,0.2043,0.0000,0.0000,0.0320,0.0016,0.0000,0.0000,132.9470,6.6094,0.0000,0.0000,0.0000,0.0000,0.0000,0.0000,0.0000,0.0000,0.0000,0.0000,0.0000,0.0000,0.0000,0.0000,2.6004,0.0578,0.0000,0.0000,49.4069,1.0979,0.0000,0.0000,0.8947,0.0199,0.0000,0.0000,16.9985,0.3777,0.0000,0.0000
1971.75,283,60.0000,127.9737,48.1504,2.5342,46.9531,7.4938,0.0000,0.0000,0.0000,0.0000,0.0000,0.0000,0.0000,0.0000,0.0000,0.0000,0.0000,0.0000,0.0000,0.0000,40.2234,1.6323,0.0000,0.0000,40.2234,1.6323,0.0000,0.0000,0.0000,0.0000,0.0000,0.0000,0.0000,0.0000,0.0000,0.0000,38.7149,1.1135,0.0000,0.0000,0.3373,0.0208,0.0000,0.0000,46.9531,7.4938,0.0000,0.0000,0.0000,0.0000,0.0000,0.0000,0.0000,0.0000,0.0000,0.0000,0.0000,0.0000,0.0000,0.0000,1.5755,0.0647,0.0000,0.0000,29.9339,1.2287,0.0000,0.0000,0.4770,0.0197,0.0000,0.0000,9.0625,0.3744,0.0000,0.0000
1972.75,293,3.6000,403.6539,107.5570,5.6609,241.2281,8.8432,0.0000,0.0000,0.0000,0.0000,0.0000,0.0000,0.0000,0.0000,0.0000,0.0000,0.0000,0.0000,0.0000,0.0000,80.8276,1.2439,0.0000,0.0000,80.8276,1.2439,0.0000,0.0000,0.0000,13.7600,0.0000,0.0000,0.0000,0.0000,0.0000,0.0000,30.7980,1.0396,0.0000,0.0000,0.2294,0.0133,0.0000,0.0000,241.2281,8.8432,0.0000,0.0000,0.0000,0.0000,0.0000,0.0000,0.0000,0.0000,0.0000,0.0000,0.0000,0.0000,0.0000,0.0000,3.6122,0.0801,0.0000,0.0000,68.6310,1.5221,0.0000,0.0000,0.9959,0.0221,0.0000,0.0000,18.9226,0.4193,0.0000,0.0000
1973.75,283,60.0000,123.5335,47.9526,2.5238,45.4153,7.1778,0.0000,0.0000,0.0000,0.0000,0.0000,0.0000,0.0000,0.0000,0.0000,0.0000,0.0000,0.0000,0.0000,0.0000,38.6618,1.5533,0.0000,0.0000,38.6618,1.5533,0.0000,0.0000,0.0000,0.0000,0.0000,0.0000,0.0000,0.0000,0.0000,0.0000,35.8999,0.9834,0.0000,0.0000,0.1995,0.0115,0.0000,0.0000,45.4153,7.1778,0.0000,0.0000,0.0000,0.0000,0.0000,0.0000,0.0000,0.0000,0.0000,0.0000,0.0000,0.0000,0.0000,0.0000,1.4903,0.0610,0.0000,0.0000,28.3162,1.1598,0.0000,0.0000,0.4946,0.0204,0.0000,0.0000,9.3978,0.3876,0.0000,0.0000
1974.75,293,3.6000,352.2763,88.9524,4.6817,211.0554,8.2592,0.0000,0.0000,0.0000,0.0000,0.0000,0.0000,0.0000,0.0000,0.0000,0.0000,0.0000,0.0000,0.0000,0.0000,70.3518,1.1563,0.0000,0.0000,70.3518,1.1563,0.0000,0.0000,0.0000,13.7600,0.0000,0.0000,0.0000,0.0000,0.0000,0.0000,24.0683,1.2337,0.0000,0.0000,0.3487,0.0196,0.0000,0.0000,211.0554,8.2592,0.0000,0.0000,0.0000,0.0000,0.0000,0.0000,0.0000,0.0000,0.0000,0.0000,0.0000,0.0000,0.0000,0.0000,3.0684,0.0682,0.0000,0.0000,58.2991,1.2955,0.0000,0.0000,0.8024,0.0178,0.0000,0.0000,15.2451,0.3388,0.0000,0.0000
1975.75,283,60.0000,161.3609,53.2472,2.8025,59.4458,8.7509,0.0000,0.0000,0.0000,0.0000,0.0000,0.0000,0.0000,0.0000,0.0000,0.0000,0.0000,0.0000,0.0000,0.0000,50.6093,1.8939,0.0000,0.0000,50.6093,1.8939,0.0000,0.0000,0.0000,0.0000,0.0000,0.0000,0.0000,0.0000,0.0000,0.0000,50.6029,2.1277,0.0000,0.0000,0.5017,0.0273,0.0000,0.0000,59.4458,8.7509,0.0000,0.0000,0.0000,0.0000,0.0000,0.0000,0.0000,0.0000,0.0000,0.0000,0.0000,0.0000,0.0000,0.0000,1.7855,0.0723,0.0000,0.0000,33.9250,1.3730,0.0000,0.0000,0.5107,0.0208,0.0000,0.0000,9.7039,0.3961,0.0000,0.0000
1976.75,293,3.7000,291.1031,97.6617,5.1401,174.2504,7.5200,0.0000,0.0000,0.0000,0.0000,0.0000,0.0000,0.0000,0.0000,0.0000,0.0000,0.0000,0.0000,0.0000,0.0000,58.0835,1.0528,0.0000,0.0000,58.0835,1.0528,0.0000,0.0000,0.0000,19.6000,0.0000,0.0000,0.0000,0.0000,0.0000,0.0000,26.1326,1.0570,0.0000,0.0000,0.2449,0.0131,0.0000,0.0000,174.2504,7.5200,0.0000,0.0000,0.0000,0.0000,0.0000,0.0000,0.0000,0.0000,0.0000,0.0000,0.0000,0.0000,0.0000,0.0000,3.0926,0.0687,0.0000,0.0000,58.7585,1.3057,0.0000,0.0000,0.9234,0.0205,0.0000,0.0000,17.5447,0.3899,0.0000,0.0000
1977.75,283,60.0000,126.7919,46.6276,2.4541,46.7416,7.6636,0.0000,0.0000,0.0000,0.0000,0.0000,0.0000,0.0000,0.0000,0.0000,0.0000,0.0000,0.0000,0.0000,0.0000,39.8033,1.6590,0.0000,0.0000,39.8033,1.6590,0.0000,0.0000,0.0000,0.0000,0.0000,0.0000,0.0000,0.0000,0.0000,0.0000,22.4389,0.7442,0.0000,0.0000,0.3122,0.0211,0.0000,0.0000,46.7416,7.6636,0.0000,0.0000,0.0000,0.0000,0.0000,0.0000,0.0000,0.0000,0.0000,0.0000,0.0000,0.0000,0.0000,0.0000,1.4555,0.0600,0.0000,0.0000,27.6540,1.1397,0.0000,0.0000,0.4726,0.0196,0.0000,0.0000,8.9786,0.3721,0.0000,0.0000
1978.75,293,3.7000,351.0914,106.6828,5.6149,207.3552,8.1979,0.0000,0.0000,0.0000,0.0000,0.0000,0.0000,0.0000,0.0000,0.0000,0.0000,0.0000,0.0000,0.0000,0.0000,71.6004,1.1853,0.0000,0.0000,71.6004,1.1853,0.0000,0.0000,0.0000,19.6000,0.0000,0.0000,0.0000,0.0000,0.0000,0.0000,33.5574,1.3400,0.0000,0.0000,0.3520,0.0216,0.0000,0.0000,207.3552,8.1979,0.0000,0.0000,0.0000,0.0000,0.0000,0.0000,0.0000,0.0000,0.0000,0.0000,0.0000,0.0000,0.0000,0.0000,3.3467,0.0744,0.0000,0.0000,63.5864,1.4140,0.0000,0.0000,0.9676,0.0215,0.0000,0.0000,18.3841,0.4091,0.0000,0.0000
1979.75,283,60.0000,134.8617,46.5454,2.4498,49.8131,8.0961,0.0000,0.0000,0.0000,0.0000,0.0000,0.0000,0.0000,0.0000,0.0000,0.0000,0.0000,0.0000,0.0000,0.0000,42.4085,1.7521,0.0000,0.0000,42.4085,1.7521,0.0000,0.0000,0.0000,0.0000,0.0000,0.0000,0.0000,0.0000,0.0000,0.0000,28.2066,1.0775,0.0000,0.0000,0.3304,0.0224,0.0000,0.0000,49.8131,8.0961,0.0000,0.0000,0.0000,0.0000,0.0000,0.0000,0.0000,0.0000,0.0000,0.0000,0.0000,0.0000,0.0000,0.0000,1.5397,0.0634,0.0000,0.0000,29.2539,1.2044,0.0000,0.0000,0.4607,0.0191,0.0000,0.0000,8.7542,0.3624,0.0000,0.0000
1980.75,293,3.8000,452.3457,131.7189,6.9326,271.2537,9.4774,0.0000,0.0000,0.0000,0.0000,0.0000,0.0000,0.0000,0.0000,0.0000,0.0000,0.0000,0.0000,0.0000,0.0000,90.4179,1.3268,0.0000,0.0000,90.4179,1.3268,0.0000,0.0000,0.0000,19.6000,0.0000,0.0000,0.0000,0.0000,0.0000,0.0000,16.9188,0.9908,0.0000,0.0000,0.1613,0.0102,0.0000,0.0000,271.2537,9.4774,0.0000,0.0000,0.0000,0.0000,0.0000,0.0000,0.0000,0.0000,0.0000,0.0000,0.0000,0.0000,0.0000,0.0000,4.2843,0.0952,0.0000,0.0000,81.4011,1.8092,0.0000,0.0000,1.3106,0.0291,0.0000,0.0000,24.9021,0.5536,0.0000,0.0000
1981.75,283,60.0000,180.5375,57.9132,3.0481,66.6389,10.3158,0.0000,0.0000,0.0000,0.0000,0.0000,0.0000,0.0000,0.0000,0.0000,0.0000,0.0000,0.0000,0.0000,0.0000,56.7331,2.2325,0.0000,0.0000,56.7331,2.2325,0.0000,0.0000,0.0000,0.0000,0.0000,0.0000,0.0000,0.0000,0.0000,0.0000,29.1300,1.9891,0.0000,0.0000,0.6307,0.0412,0.0000,0.0000,66.6389,10.3158,0.0000,0.0000,0.0000,0.0000,0.0000,0.0000,0.0000,0.0000,0.0000,0.0000,0.0000,0.0000,0.0000,0.0000,1.9853,0.0810,0.0000,0.0000,37.7215,1.5393,0.0000,0.0000,0.5415,0.0223,0.0000,0.0000,10.2889,0.4230,0.0000,0.0000
1982.75,293,3.8000,468.9358,134.3227,7.0696,269.8113,9.4848,0.0000,0.0000,0.0000,0.0000,0.0000,0.0000,0.0000,0.0000,0.0000,0.0000,0.0000,0.0000,0.0000,0.0000,99.0231,1.4493,0.0000,0.0000,99.0231,1.4493,0.0000,0.0000,0.0000,19.6000,0.0000,0.0000,0.0000,0.0000,0.0000,0.0000,32.9629,1.0098,0.0000,0.0000,0.1394,0.0087,0.0000,0.0000,269.8113,9.4848,0.0000,0.0000,0.0000,0.0000,0.0000,0.0000,0.0000,0.0000,0.0000,0.0000,0.0000,0.0000,0.0000,0.0000,4.3589,0.0969,0.0000,0.0000,82.8186,1.8410,0.0000,0.0000,1.2127,0.0270,0.0000,0.0000,23.0405,0.5124,0.0000,0.0000
1983.75,283,60.0000,131.9164,50.0006,2.6316,48.2762,7.8004,0.0000,0.0000,0.0000,0.0000,0.0000,0.0000,0.0000,0.0000,0.0000,0.0000,0.0000,0.0000,0.0000,0.0000,41.7229,1.7148,0.0000,0.0000,41.7229,1.7148,0.0000,0.0000,0.0000,0.0000,0.0000,0.0000,0.0000,0.0000,0.0000,0.0000,28.5002,2.0961,0.0000,0.0000,0.3692,0.0233,0.0000,0.0000,48.2762,7.8004,0.0000,0.0000,0.0000,0.0000,0.0000,0.0000,0.0000,0.0000,0.0000,0.0000,0.0000,0.0000,0.0000,0.0000,1.5328,0.0630,0.0000,0.0000,29.1234,1.1962,0.0000,0.0000,0.5130,0.0212,0.0000,0.0000,9.7475,0.4028,0.0000,0.0000
1984.75,293,3.8000,370.4806,118.9829,6.2623,216.0707,8.3762,0.0000,0.0000,0.0000,0.0000,0.0000,0.0000,0.0000,0.0000,0.0000,0.0000,0.0000,0.0000,0.0000,0.0000,76.9668,1.2458,0.0000,0.0000,76.9668,1.2458,0.0000,0.0000,0.0000,19.6000,0.0000,0.0000,0.0000,0.0000,0.0000,0.0000,42.5136,1.9931,0.0000,0.0000,0.2474,0.0148,0.0000,0.0000,216.0707,8.3762,0.0000,0.0000,0.0000,0.0000,0.0000,0.0000,0.0000,0.0000,0.0000,0.0000,0.0000,0.0000,0.0000,0.0000,3.8100,0.0847,0.0000,0.0000,72.3902,1.6089,0.0000,0.0000,1.1260,0.0250,0.0000,0.0000,21.3938,0.4756,0.0000,0.0000
1985.75,283,60.0000,143.5379,50.1321,2.6385,52.6709,8.5174,0.0000,0.0000,0.0000,0.0000,0.0000,0.0000,0.0000,0.0000,0.0000,0.0000,0.0000,0.0000,0.0000,0.0000,45.1504,1.8566,0.0000,0.0000,45.1504,1.8566,0.0000,0.0000,0.0000,0.0000,0.0000,0.0000,0.0000,0.0000,0.0000,0.0000,28.8815,1.5018,0.0000,0.0000,0.2503,0.0159,0.0000,0.0000,52.6709,8.5174,0.0000,0.0000,0.0000,0.0000,0.0000,0.0000,0.0000,0.0000,0.0000,0.0000,0.0000,0.0000,0.0000,0.0000,1.6187,0.0665,0.0000,0.0000,30.7560,1.2640,0.0000,0.0000,0.4760,0.0197,0.0000,0.0000,9.0439,0.3740,0.0000,0.0000
1986.75,293,3.9000,748.7963,234.4956,12.3419,400.5002,12.3455,0.0000,0.0000,0.0000,0.0000,0.0000,0.0000,0.0000,0.0000,0.0000,0.0000,0.0000,0.0000,0.0000,0.0000,173.0754,2.1837,0.0000,0.0000,173.0754,2.1837,0.0000,0.0000,0.0000,23.0000,0.0000,0.0000,0.0000,0.0000,0.0000,0.0000,14.9472,0.7158,0.0000,0.0000,0.2476,0.0162,0.0000,0.0000,400.5002,12.3455,0.0000,0.0000,0.0000,0.0000,0.0000,0.0000,0.0000,0.0000,0.0000,0.0000,0.0000,0.0000,0.0000,0.0000,7.4889,0.1665,0.0000,0.0000,142.2888,3.1626,0.0000,0.0000,2.2282,0.0495,0.0000,0.0000,42.3355,0.9412,0.0000,0.0000
1987.75,283,60.0000,151.6532,54.7258,2.8803,55.9719,8.4524,0.0000,0.0000,0.0000,0.0000,0.0000,0.0000,0.0000,0.0000,0.0000,0.0000,0.0000,0.0000,0.0000,0.0000,47.6517,1.8293,0.0000,0.0000,47.6517,1.8293,0.0000,0.0000,0.0000,0.0000,0.0000,0.0000,0.0000,0.0000,0.0000,0.0000,14.5537,0.9564,0.0000,0.0000,0.3779,0.0202,0.0000,0.0000,55.9719,8.4524,0.0000,0.0000,0.0000,0.0000,0.0000,0.0000,0.0000,0.0000,0.0000,0.0000,0.0000,0.0000,0.0000,0.0000,1.7825,0.0723,0.0000,0.0000,33.8679,1.3745,0.0000,0.0000,0.5359,0.0219,0.0000,0.0000,10.1829,0.4159,0.0000,0.0000
1988.75,293,3.9000,441.7316,164.7050,8.6687,243.4872,8.9855,0.0000,0.0000,0.0000,0.0000,0.0000,0.0000,0.0000,0.0000,0.0000,0.0000,0.0000,0.0000,0.0000,0.0000,98.3281,1.4963,0.0000,0.0000,98.3281,1.4963,0.0000,0.0000,0.0000,23.0000,0.0000,0.0000,0.0000,0.0000,0.0000,0.0000,16.5694,0.3044,0.0000,0.0000,0.0258,0.0013,0.0000,0.0000,243.4872,8.9855,0.0000,0.0000,0.0000,0.0000,0.0000,0.0000,0.0000,0.0000,0.0000,0.0000,0.0000,0.0000,0.0000,0.0000,4.8591,0.1080,0.0000,0.0000,92.3220,2.0518,0.0000,0.0000,1.5898,0.0353,0.0000,0.0000,30.2064,0.6715,0.0000,0.0000
1989.75,283,60.0000,132.2299,48.0825,2.5307,48.5142,8.0979,0.0000,0.0000,0.0000,0.0000,0.0000,0.0000,0.0000,0.0000,0.0000,0.0000,0.0000,0.0000,0.0000,0.0000,41.5673,1.7642,0.0000,0.0000,41.5673,1.7642,0.0000,0.0000,0.0000,0.0000,0.0000,0.0000,0.0000,0.0000,0.0000,0.0000,34.6046,1.2757,0.0000,0.0000,0.4393,0.0282,0.0000,0.0000,48.5142,8.0979,0.0000,0.0000,0.0000,0.0000,0.0000,0.0000,0.0000,0.0000,0.0000,0.0000,0.0000,0.0000,0.0000,0.0000,1.5801,0.0653,0.0000,0.0000,30.0217,1.2402,0.0000,0.0000,0.4735,0.0196,0.0000,0.0000,8.9959,0.3732,0.0000,0.0000
1990.75,293,3.9000,775.0490,213.0492,11.2131,463.1168,13.3644,0.0000,0.0000,0.0000,0.0000,0.0000,0.0000,0.0000,0.0000,0.0000,0.0000,0.0000,0.0000,0.0000,0.0000,155.2698,1.8809,0.0000,0.0000,155.2698,1.8809,0.0000,0.0000,0.0000,23.0000,0.0000,0.0000,0.0000,0.0000,0.0000,0.0000,26.7199,0.9664,0.0000,0.0000,0.3022,0.0195,0.0000,0.0000,463.1168,13.3644,0.0000,0.0000,0.0000,0.0000,0.0000,0.0000,0.0000,0.0000,0.0000,0.0000,0.0000,0.0000,0.0000,0.0000,7.2282,0.1607,0.0000,0.0000,137.3354,3.0526,0.0000,0.0000,1.9291,0.0429,0.0000,0.0000,36.6524,0.8149,0.0000,0.0000
1991.75,283,60.0000,122.5863,46.1273,2.4278,45.2146,7.3408,0.0000,0.0000,0.0000,0.0000,0.0000,0.0000,0.0000,0.0000,0.0000,0.0000,0.0000,0.0000,0.0000,0.0000,38.4931,1.5887,0.0000,0.0000,38.4931,1.5887,0.0000,0.0000,0.0000,0.0000,0.0000,0.0000,0.0000,0.0000,0.0000,0.0000,32.6340,0.8877,0.0000,0.0000,0.2364,0.0135,0.0000,0.0000,45.2146,7.3408,0.0000,0.0000,0.0000,0.0000,0.0000,0.0000,0.0000,0.0000,0.0000,0.0000,0.0000,0.0000,0.0000,0.0000,1.4557,0.0599,0.0000,0.0000,27.6590,1.1374,0.0000,0.0000,0.4720,0.0195,0.0000,0.0000,8.9689,0.3709,0.0000,0.0000
1992.75,293,3.9000,666.2521,171.4110,9.0216,399.1821,12.0534,0.0000,0.0000,0.0000,0.0000,0.0000,0.0000,0.0000,0.0000,0.0000,0.0000,0.0000,0.0000,0.0000,0.0000,133.0607,1.6875,0.0000,0.0000,133.0607,1.6875,0.0000,0.0000,0.0000,23.0000,0.0000,0.0000,0.0000,0.0000,0.0000,0.0000,21.0508,1.2254,0.0000,0.0000,0.4608,0.0274,0.0000,0.0000,399.1821,12.0534,0.0000,0.0000,0.0000,0.0000,0.0000,0.0000,0.0000,0.0000,0.0000,0.0000,0.0000,0.0000,0.0000,0.0000,6.0427,0.1343,0.0000,0.0000,114.8121,2.5518,0.0000,0.0000,1.4743,0.0328,0.0000,0.0000,28.0124,0.6228,0.0000,0.0000
1993.75,283,60.0000,167.0211,52.4565,2.7609,61.6220,9.5122,0.0000,0.0000,0.0000,0.0000,0.0000,0.0000,0.0000,0.0000,0.0000,0.0000,0.0000,0.0000,0.0000,0.0000,52.4620,2.0586,0.0000,0.0000,52.4620,2.0586,0.0000,0.0000,0.0000,0.0000,0.0000,0.0000,0.0000,0.0000,0.0000,0.0000,47.0082,2.2179,0.0000,0.0000,0.7010,0.0385,0.0000,0.0000,61.6220,9.5122,0.0000,0.0000,0.0000,0.0000,0.0000,0.0000,0.0000,0.0000,0.0000,0.0000,0.0000,0.0000,0.0000,0.0000,1.7766,0.0723,0.0000,0.0000,33.7556,1.3745,0.0000,0.0000,0.5006,0.0205,0.0000,0.0000,9.5108,0.3896,0.0000,0.0000
1994.75,293,3.9000,526.3843,182.7106,9.6163,314.7673,10.3740,0.0000,0.0000,0.0000,0.0000,0.0000,0.0000,0.0000,0.0000,0.0000,0.0000,0.0000,0.0000,0.0000,0.0000,105.2033,1.4559,0.0000,0.0000,105.2033,1.4559,0.0000,0.0000,0.0000,23.0000,0.0000,0.0000,0.0000,0.0000,0.0000,0.0000,24.3202,1.0691,0.0000,0.0000,0.3609,0.0204,0.0000,0.0000,314.7673,10.3740,0.0000,0.0000,0.0000,0.0000,0.0000,0.0000,0.0000,0.0000,0.0000,0.0000,0.0000,0.0000,0.0000,0.0000,5.8710,0.1305,0.0000,0.0000,111.5483,2.4794,0.0000,0.0000,1.6361,0.0364,0.0000,0.0000,31.0856,0.6911,0.0000,0.0000
1995.75,283,60.0000,127.5201,46.6904,2.4574,47.0153,7.7778,0.0000,0.0000,0.0000,0.0000,0.0000,0.0000,0.0000,0.0000,0.0000,0.0000,0.0000,0.0000,0.0000,0.0000,40.0284,1.6833,0.0000,0.0000,40.0284,1.6833,0.0000,0.0000,0.0000,0.0000,0.0000,0.0000,0.0000,0.0000,0.0000,0.0000,23.3129,0.7490,0.0000,0.0000,0.4936,0.0306,0.0000,0.0000,47.0153,7.7778,0.0000,0.0000,0.0000,0.0000,0.0000,0.0000,0.0000,0.0000,0.0000,0.0000,0.0000,0.0000,0.0000,0.0000,1.4612,0.0603,0.0000,0.0000,27.7637,1.1451,0.0000,0.0000,0.4720,0.0195,0.0000,0.0000,8.9685,0.3714,0.0000,0.0000
1996.75,293,3.1000,953.3083,303.5756,15.9777,562.5181,15.4397,0.0000,0.0000,0.0000,0.0000,0.0000,0.0000,0.0000,0.0000,0.0000,0.0000,0.0000,0.0000,0.0000,0.0000,194.7180,2.2373,0.0000,0.0000,194.7180,2.2373,0.0000,0.0000,0.0000,26.0000,0.0000,0.0000,0.0000,0.0000,0.0000,0.0000,33.3233,1.1610,0.0000,0.0000,0.5371,0.0326,0.0000,0.0000,562.5181,15.4397,0.0000,0.0000,0.0000,0.0000,0.0000,0.0000,0.0000,0.0000,0.0000,0.0000,0.0000,0.0000,0.0000,0.0000,9.6083,0.2135,0.0000,0.0000,182.5574,4.0573,0.0000,0.0000,2.6423,0.0587,0.0000,0.0000,50.2042,1.1159,0.0000,0.0000
1997.75,293,3.1000,718.8788,259.6945,13.6681,431.2081,12.1983,0.0000,0.0000,0.0000,0.0000,0.0000,0.0000,0.0000,0.0000,0.0000,0.0000,0.0000,0.0000,0.0000,0.0000,143.1144,1.7010,0.0000,0.0000,143.1144,1.7010,0.0000,0.0000,0.0000,26.0000,0.0000,0.0000,0.0000,0.0000,0.0000,0.0000,29.9941,0.7959,0.0000,0.0000,0.4205,0.0248,0.0000,0.0000,431.2081,12.1983,0.0000,0.0000,0.0000,0.0000,0.0000,0.0000,0.0000,0.0000,0.0000,0.0000,0.0000,0.0000,0.0000,0.0000,9.0229,0.1951,0.0000,0.0000,171.4346,3.7062,0.0000,0.0000,2.1993,0.0482,0.0000,0.0000,41.7864,0.9166,0.0000,0.0000
1998.75,283,60.1000,193.8975,53.8537,2.8344,53.8067,9.3974,0.0000,0.0000,0.0000,0.0000,0.0000,0.0000,0.0000,0.0000,0.0000,0.0000,0.0000,0.0000,0.0000,0.0000,69.6931,2.2887,0.0000,0.0000,69.6931,2.2887,0.0000,0.0000,0.0000,0.0000,0.0000,0.0000,0.0000,0.0000,0.0000,0.0000,48.2145,1.4177,0.0000,0.0000,1.8079,0.0966,0.0000,0.0000,53.8067,9.3974,0.0000,0.0000,0.0000,0.0000,0.0000,0.0000,0.0000,0.0000,0.0000,0.0000,0.0000,0.0000,0.0000,0.0000,1.8132,0.0750,0.0000,0.0000,34.4504,1.4256,0.0000,0.0000,0.5071,0.0209,0.0000,0.0000,9.6342,0.3972,0.0000,0.0000
1999.75,293,3.1000,972.4569,338.4651,17.8140,545.3869,15.2741,0.0000,0.0000,0.0000,0.0000,0.0000,0.0000,0.0000,0.0000,0.0000,0.0000,0.0000,0.0000,0.0000,0.0000,212.7280,2.4656,0.0000,0.0000,212.7280,2.4656,0.0000,0.0000,0.0000,26.0000,0.0000,0.0000,0.0000,0.0000,0.0000,0.0000,23.5891,0.3813,0.0000,0.0000,0.2754,0.0153,0.0000,0.0000,545.3869,15.2741,0.0000,0.0000,0.0000,0.0000,0.0000,0.0000,0.0000,0.0000,0.0000,0.0000,0.0000,0.0000,0.0000,0.0000,10.7207,0.2383,0.0000,0.0000,203.6926,4.5272,0.0000,0.0000,3.1201,0.0694,0.0000,0.0000,59.2824,1.3179,0.0000,0.0000
2000.75,293,3.1000,747.1180,295.5191,15.5536,442.1064,12.0574,0.0000,0.0000,0.0000,0.0000,0.0000,0.0000,0.0000,0.0000,0.0000,0.0000,0.0000,0.0000,0.0000,0.0000,151.3379,1.7295,0.0000,0.0000,151.3379,1.7295,0.0000,0.0000,0.0000,26.0000,0.0000,0.0000,0.0000,0.0000,0.0000,0.0000,9.3221,0.1188,0.0000,0.0000,0.3390,0.0202,0.0000,0.0000,442.1064,12.0574,0.0000,0.0000,0.0000,0.0000,0.0000,0.0000,0.0000,0.0000,0.0000,0.0000,0.0000,0.0000,0.0000,0.0000,9.8275,0.2074,0.0000,0.0000,186.7234,3.9410,0.0000,0.0000,2.6627,0.0571,0.0000,0.0000,50.5904,1.0842,0.0000,0.0000
2001.75,283,60.1000,183.2393,48.1205,2.5327,54.8483,9.4531,0.0000,0.0000,0.0000,0.0000,0.0000,0.0000,0.0000,0.0000,0.0000,0.0000,0.0000,0.0000,0.0000,0.0000,63.9424,2.0441,0.0000,0.0000,63.9424,2.0441,0.0000,0.0000,0.0000,0.0000,0.0000,0.0000,0.0000,0.0000,0.0000,0.0000,9.7568,0.0805,0.0000,0.0000,0.2571,0.0139,0.0000,0.0000,54.8483,9.4531,0.0000,0.0000,0.0000,0.0000,0.0000,0.0000,0.0000,0.0000,0.0000,0.0000,0.0000,0.0000,0.0000,0.0000,1.6683,0.0691,0.0000,0.0000,31.6971,1.3133,0.0000,0.0000,0.4457,0.0184,0.0000,0.0000,8.4691,0.3495,0.0000,0.0000
2002.75,293,3.1000,1064.1018,292.3238,15.3855,641.5813,16.9300,0.0000,0.0000,0.0000,0.0000,0.0000,0.0000,0.0000,0.0000,0.0000,0.0000,0.0000,0.0000,0.0000,0.0000,210.5197,2.3363,0.0000,0.0000,210.5197,2.3363,0.0000,0.0000,0.0000,26.0000,0.0000,0.0000,0.0000,0.0000,0.0000,0.0000,34.1264,0.7037,0.0000,0.0000,0.8991,0.0527,0.0000,0.0000,641.5813,16.9300,0.0000,0.0000,0.0000,0.0000,0.0000,0.0000,0.0000,0.0000,0.0000,0.0000,0.0000,0.0000,0.0000,0.0000,9.7266,0.2161,0.0000,0.0000,184.8063,4.1061,0.0000,0.0000,2.7691,0.0616,0.0000,0.0000,52.6125,1.1695,0.0000,0.0000
2003.75,293,3.1000,804.2012,284.1906,14.9574,481.1213,12.7404,0.0000,0.0000,0.0000,0.0000,0.0000,0.0000,0.0000,0.0000,0.0000,0.0000,0.0000,0.0000,0.0000,0.0000,160.3738,1.7837,0.0000,0.0000,160.3738,1.7837,0.0000,0.0000,0.0000,26.0000,0.0000,0.0000,0.0000,0.0000,0.0000,0.0000,17.1345,0.2561,0.0000,0.0000,0.7985,0.0485,0.0000,0.0000,481.1213,12.7404,0.0000,0.0000,0.0000,0.0000,0.0000,0.0000,0.0000,0.0000,0.0000,0.0000,0.0000,0.0000,0.0000,0.0000,10.0107,0.2124,0.0000,0.0000,190.2040,4.0350,0.0000,0.0000,2.4309,0.0525,0.0000,0.0000,46.1868,0.9968,0.0000,0.0000
2004.75,283,60.1000,170.4085,47.5500,2.5026,50.9095,9.0303,0.0000,0.0000,0.0000,0.0000,0.0000,0.0000,0.0000,0.0000,0.0000,0.0000,0.0000,0.0000,0.0000,0.0000,59.3944,1.9543,0.0000,0.0000,59.3944,1.9543,0.0000,0.0000,0.0000,0.0000,0.0000,0.0000,0.0000,0.0000,0.0000,0.0000,28.7668,0.4174,0.0000,0.0000,0.8783,0.0482,0.0000,0.0000,50.9095,9.0303,0.0000,0.0000,0.0000,0.0000,0.0000,0.0000,0.0000,0.0000,0.0000,0.0000,0.0000,0.0000,0.0000,0.0000,1.6572,0.0688,0.0000,0.0000,31.4867,1.3066,0.0000,0.0000,0.4186,0.0173,0.0000,0.0000,7.9537,0.3291,0.0000,0.0000
2005.75,293,3.1000,895.9315,280.3309,14.7543,535.2588,14.8160,0.0000,0.0000,0.0000,0.0000,0.0000,0.0000,0.0000,0.0000,0.0000,0.0000,0.0000,0.0000,0.0000,0.0000,178.9380,2.0797,0.0000,0.0000,178.9380,2.0797,0.0000,0.0000,0.0000,26.0000,0.0000,0.0000,0.0000,0.0000,0.0000,0.0000,19.7923,0.1611,0.0000,0.0000,0.2315,0.0134,0.0000,0.0000,535.2588,14.8160,0.0000,0.0000,0.0000,0.0000,0.0000,0.0000,0.0000,0.0000,0.0000,0.0000,0.0000,0.0000,0.0000,0.0000,9.0076,0.2002,0.0000,0.0000,171.1447,3.8037,0.0000,0.0000,2.6596,0.0591,0.0000,0.0000,50.5323,1.1233,0.0000,0.0000
2006.75,293,3.1000,897.1219,302.6660,15.9298,537.0411,14.1334,0.0000,0.0000,0.0000,0.0000,0.0000,0.0000,0.0000,0.0000,0.0000,0.0000,0.0000,0.0000,0.0000,0.0000,179.0138,1.9787,0.0000,0.0000,179.0138,1.9787,0.0000,0.0000,0.0000,26.0000,0.0000,0.0000,0.0000,0.0000,0.0000,0.0000,17.6156,0.3142,0.0000,0.0000,0.4799,0.0288,0.0000,0.0000,537.0411,14.1334,0.0000,0.0000,0.0000,0.0000,0.0000,0.0000,0.0000,0.0000,0.0000,0.0000,0.0000,0.0000,0.0000,0.0000,10.3278,0.2231,0.0000,0.0000,196.2274,4.2381,0.0000,0.0000,2.6711,0.0584,0.0000,0.0000,50.7512,1.1102,0.0000,0.0000
2007.75,283,60.1000,202.2601,56.7455,2.9866,60.1604,10.0497,0.0000,0.0000,0.0000,0.0000,0.0000,0.0000,0.0000,0.0000,0.0000,0.0000,0.0000,0.0000,0.0000,0.0000,70.7760,2.1961,0.0000,0.0000,70.7760,2.1961,0.0000,0.0000,0.0000,0.0000,0.0000,0.0000,0.0000,0.0000,0.0000,0.0000,13.7706,0.2161,0.0000,0.0000,0.2352,0.0131,0.0000,0.0000,60.1604,10.0497,0.0000,0.0000,0.0000,0.0000,0.0000,0.0000,0.0000,0.0000,0.0000,0.0000,0.0000,0.0000,0.0000,0.0000,1.8818,0.0782,0.0000,0.0000,35.7544,1.4849,0.0000,0.0000,0.5447,0.0226,0.0000,0.0000,10.3499,0.4288,0.0000,0.0000
