    time,     N2Oflux,      NOflux,      N2flux,    CH4_oxid,         NIT,      ANNPPT
 2008.92,    1.464808,    1.100942,    0.546442,    0.166460,   10.559360,  130.899979
 2009.92,    1.918470,    1.519730,    0.961416,    0.170820,   13.390659,  119.799988
 2010.92,    1.500829,    1.471184,    0.888442,    0.206555,    6.844418,   99.899979
 2011.92,    2.007788,    2.201017,    0.894927,    0.217128,    8.551326,   96.599968
 2012.92,    0.820849,    0.675573,    0.192163,    0.192936,    6.345281,   91.300011
 2013.92,    0.596962,    0.304870,    0.285288,    0.168926,    3.346625,  107.299965
 2014.92,    0.548478,    0.278910,    0.308081,    0.153814,    2.426348,  116.999954
 2015.92,    0.642994,    0.406431,    0.333613,    0.168611,    2.603489,  128.499969
 2016.92,    1.835368,    1.265074,    0.564046,    0.168343,   13.781704,  106.099983
 2017.92,    1.268188,    1.483995,    0.896744,    0.209163,    5.419317,   90.499985
 2018.92,    1.520359,    1.291554,    0.360003,    0.180809,   10.488048,  130.509979
 2019.92,    1.309494,    1.245881,    0.495419,    0.171120,    6.495848,  128.499969
 2020.92,    1.169173,    0.802737,    0.301690,    0.163879,    9.583884,  130.899979
 2021.92,    1.051648,    0.974500,    0.389303,    0.172386,    5.968167,  119.799988
 2022.92,    1.190632,    0.888611,    0.192852,    0.202015,   10.663752,   99.899979
 2023.92,    0.815996,    0.881810,    0.224360,    0.216482,    4.671283,   96.599968
 2024.92,    1.047387,    1.135062,    0.217868,    0.191786,    9.286339,   91.300011
 2025.92,    0.859453,    0.794748,    0.312041,    0.175813,    4.869277,  107.299965
 2026.92,    1.173183,    0.772184,    0.251797,    0.158700,   10.322626,  116.999954
 2027.92,    0.876365,    0.833915,    0.273846,    0.180286,    5.069861,  128.499969
 2028.92,    1.120866,    0.798605,    0.209045,    0.171514,   10.129080,  106.099983
 2029.92,    0.646478,    0.769179,    0.145939,    0.212206,    4.467726,   90.499985
 2030.92,    1.043060,    0.904689,    0.185524,    0.180953,    9.669719,  130.509979
