time,dayofyr,crpval,agcacc,bgcjacc,bgcmacc,cgrain,egrain(N),egrain(P),egrain(S),crmvst,ermvst(N),ermvst(P),ermvst(S),cstraw,estraw(N),estraw(P),estraw(S),stdstraw,estdstraw(N),estdstraw(P),estdstraw(S),addsdc,addsde(N),addsde(P),addsde(S),resid,reside(N),reside(P),reside(S),irrapp,fertapp(N),fertapp(P),fertapp(S),omadapp,omaeapp(N),omaeapp(P),omaeapp(S),strmac(1),strmac(2),strmac(3),strmac(4),strmac(5),strmac(6),strmac(7),strmac(8),cgracc,egracc(N),egracc(P),egracc(S),accrst,accrste(N),accrste(P),accrste(S),ctubesj,etubesj(N),etubesj(P),etubesj(S),ctubesm,etubesm(N),etubesm(P),etubesm(S),srfclittrj,srfclittrj(N),esrfclittrj(P),esrfclittrj(S),soillittrj,esoillittrj(N),esoillittrj(P),esoillittrj(S),srfclittrm,esrfclittrm(N),esrfclittrm(P),esrfclittrm(S),soillittrm,esoillittrm(N),esoillittrm(P),esoillittrm(S)
2008.75,302,3.1000,876.7198,291.0782,15.3199,518.0341,13.8467,0.0000,0.0000,321.9158,3.6028,0.0000,0.0000,321.9158,3.6028,0.0000,0.0000,0.0000,0.0000,0.0000,0.0000,17.8842,0.2002,0.0000,0.0000,17.8842,0.2002,0.0000,0.0000,0.0000,16.8000,0.0000,0.0000,0.0000,0.0000,0.0000,0.0000,37.0725,0.8032,0.0000,0.0000,0.6425,0.0295,0.0000,0.0000,518.0341,13.8467,0.0000,0.0000,321.9158,0.0000,0.0000,0.0000,0.0000,0.0000,0.0000,0.0000,0.0000,0.0000,0.0000,0.0000,10.1887,0.2197,0.0000,0.0000,193.5855,4.1738,0.0000,0.0000,2.4576,0.0538,0.0000,0.0000,46.6938,1.0230,0.0000,0.0000
2009.83,307,3.1000,823.3663,298.4262,15.7067,493.1036,13.2699,0.0000,0.0000,295.8622,3.3440,0.0000,0.0000,295.8622,3.3440,0.0000,0.0000,0.0000,0.0000,0.0000,0.0000,16.4368,0.1858,0.0000,0.0000,16.4368,0.1858,0.0000,0.0000,0.0000,20.2000,0.0000,0.0000,0.0000,0.0000,0.0000,0.0000,37.6955,1.2286,0.0000,0.0000,0.6763,0.0297,0.0000,0.0000,493.1036,13.2699,0.0000,0.0000,295.8622,0.0000,0.0000,0.0000,0.0000,0.0000,0.0000,0.0000,0.0000,0.0000,0.0000,0.0000,10.3899,0.2234,0.0000,0.0000,197.4081,4.2443,0.0000,0.0000,2.4768,0.0541,0.0000,0.0000,47.0601,1.0273,0.0000,0.0000
2010.75,285,60.2000,201.1620,60.5099,3.1847,65.9980,9.9393,0.0000,0.0000,0.0000,0.0000,0.0000,0.0000,0.0000,0.0000,0.0000,0.0000,0.0000,0.0000,0.0000,0.0000,67.2000,2.1582,0.0000,0.0000,67.2000,2.1582,0.0000,0.0000,0.0000,0.0000,0.0000,0.0000,0.0000,0.0000,0.0000,0.0000,31.5334,1.0396,0.0000,0.0000,0.7674,0.0328,0.0000,0.0000,65.9980,9.9393,0.0000,0.0000,0.0000,0.0000,0.0000,0.0000,0.0000,0.0000,0.0000,0.0000,0.0000,0.0000,0.0000,0.0000,1.9530,0.0807,0.0000,0.0000,37.1065,1.5337,0.0000,0.0000,0.5761,0.0237,0.0000,0.0000,10.9464,0.4508,0.0000,0.0000
2012.92,350,44.2000,431.0194,110.6781,5.8252,0.0000,0.0000,0.0000,0.0000,288.7208,0.9019,0.0000,0.0000,0.0595,0.0029,0.0000,0.0000,288.6613,0.8991,0.0000,0.0000,0.0000,0.0000,0.0000,0.0000,0.0000,0.0000,0.0000,0.0000,0.0000,2.3000,0.0000,0.0000,0.0000,0.0000,0.0000,0.0000,4.4586,0.1159,0.0000,0.0000,0.1690,0.0079,0.0000,0.0000,0.0000,0.0000,0.0000,0.0000,288.7208,0.9019,0.0000,0.0000,0.0000,0.0000,0.0000,0.0000,0.0000,0.0000,0.0000,0.0000,0.6800,0.0170,0.0000,0.0000,4.1773,0.1044,0.0000,0.0000,0.5087,0.0127,0.0000,0.0000,3.1251,0.0781,0.0000,0.0000
2013.92,350,44.3000,1020.7787,327.5023,17.2370,0.0000,0.0000,0.0000,0.0000,666.4733,1.3195,0.0000,0.0000,0.2021,0.0092,0.0000,0.0000,666.2712,1.3103,0.0000,0.0000,0.0000,0.0000,0.0000,0.0000,0.0000,0.0000,0.0000,0.0000,0.0000,2.3000,0.0000,0.0000,0.0000,0.0000,0.0000,0.0000,28.8420,0.3131,0.0000,0.0000,0.2503,0.0116,0.0000,0.0000,0.0000,0.0000,0.0000,0.0000,666.4733,1.3195,0.0000,0.0000,0.0000,0.0000,0.0000,0.0000,0.0000,0.0000,0.0000,0.0000,2.1685,0.0463,0.0000,0.0000,13.3207,0.2846,0.0000,0.0000,1.3853,0.0314,0.0000,0.0000,8.5094,0.1930,0.0000,0.0000
2014.92,350,44.4000,1083.1707,363.6563,19.1398,0.0000,0.0000,0.0000,0.0000,720.3669,1.3808,0.0000,0.0000,6.7904,0.1351,0.0000,0.0000,713.5766,1.2456,0.0000,0.0000,0.0000,0.0000,0.0000,0.0000,0.0000,0.0000,0.0000,0.0000,0.0000,2.3000,0.0000,0.0000,0.0000,0.0000,0.0000,0.0000,16.5853,0.0635,0.0000,0.0000,0.2999,0.0127,0.0000,0.0000,0.0000,0.0000,0.0000,0.0000,720.3669,1.3808,0.0000,0.0000,0.0000,0.0000,0.0000,0.0000,0.0000,0.0000,0.0000,0.0000,2.6998,0.0554,0.0000,0.0000,16.5843,0.3406,0.0000,0.0000,2.2008,0.0477,0.0000,0.0000,13.5193,0.2933,0.0000,0.0000
2015.92,350,44.5000,784.0343,245.1799,12.9042,0.0000,0.0000,0.0000,0.0000,527.1334,1.2559,0.0000,0.0000,5.0283,0.1251,0.0000,0.0000,522.1050,1.1308,0.0000,0.0000,0.0000,0.0000,0.0000,0.0000,0.0000,0.0000,0.0000,0.0000,0.0000,2.3000,0.0000,0.0000,0.0000,0.0000,0.0000,0.0000,20.1557,0.0230,0.0000,0.0000,0.4652,0.0190,0.0000,0.0000,0.0000,0.0000,0.0000,0.0000,527.1334,1.2559,0.0000,0.0000,0.0000,0.0000,0.0000,0.0000,0.0000,0.0000,0.0000,0.0000,2.0045,0.0428,0.0000,0.0000,12.3135,0.2629,0.0000,0.0000,2.5270,0.0547,0.0000,0.0000,15.5231,0.3363,0.0000,0.0000
2016.75,296,3.1000,1059.6769,353.5905,18.6100,634.9596,15.9156,0.0000,0.0000,380.9757,4.0107,0.0000,0.0000,380.9757,4.0107,0.0000,0.0000,0.0000,0.0000,0.0000,0.0000,21.1653,0.2228,0.0000,0.0000,21.1653,0.2228,0.0000,0.0000,0.0000,20.2000,0.0000,0.0000,0.0000,0.0000,0.0000,0.0000,21.3907,0.0114,0.0000,0.0000,0.2770,0.0119,0.0000,0.0000,634.9596,15.9156,0.0000,0.0000,380.9757,0.0000,0.0000,0.0000,0.0000,0.0000,0.0000,0.0000,0.0000,0.0000,0.0000,0.0000,13.9527,0.2981,0.0000,0.0000,265.1006,5.6632,0.0000,0.0000,10.8273,0.2348,0.0000,0.0000,205.7178,4.4609,0.0000,0.0000
2017.75,285,60.2000,149.2612,49.6745,2.6144,47.2755,7.9766,0.0000,0.0000,0.0000,0.0000,0.0000,0.0000,0.0000,0.0000,0.0000,0.0000,0.0000,0.0000,0.0000,0.0000,50.7997,1.8372,0.0000,0.0000,50.7997,1.8372,0.0000,0.0000,0.0000,0.0000,0.0000,0.0000,0.0000,0.0000,0.0000,0.0000,29.3733,0.1317,0.0000,0.0000,0.5439,0.0218,0.0000,0.0000,47.2755,7.9766,0.0000,0.0000,0.0000,0.0000,0.0000,0.0000,0.0000,0.0000,0.0000,0.0000,0.0000,0.0000,0.0000,0.0000,1.6036,0.0660,0.0000,0.0000,30.4690,1.2534,0.0000,0.0000,0.4742,0.0195,0.0000,0.0000,9.0095,0.3699,0.0000,0.0000
2018.75,288,59.1000,773.6069,118.4403,6.2337,0.0768,0.0108,0.0000,0.0000,731.4802,9.8583,0.0000,0.0000,731.4802,9.8583,0.0000,0.0000,0.0000,0.0000,0.0000,0.0000,7.6998,0.1038,0.0000,0.0000,30.7992,0.4151,0.0000,0.0000,0.0000,0.0000,0.0000,0.0000,0.0000,0.0000,0.0000,0.0000,27.4162,0.2682,0.0000,0.0000,0.6007,0.0245,0.0000,0.0000,0.0768,0.0108,0.0000,0.0000,731.4802,0.0000,0.0000,0.0000,0.0000,0.0000,0.0000,0.0000,0.0000,0.0000,0.0000,0.0000,4.2627,0.0669,0.0000,0.0000,80.9910,1.2716,0.0000,0.0000,1.0232,0.0165,0.0000,0.0000,19.4411,0.3134,0.0000,0.0000
2019.75,285,60.2000,241.7271,57.5008,3.0264,79.8754,11.1068,0.0000,0.0000,0.0000,0.0000,0.0000,0.0000,0.0000,0.0000,0.0000,0.0000,0.0000,0.0000,0.0000,0.0000,80.6809,2.3904,0.0000,0.0000,80.6809,2.3904,0.0000,0.0000,0.0000,0.0000,0.0000,0.0000,0.0000,0.0000,0.0000,0.0000,47.9919,0.5138,0.0000,0.0000,0.6572,0.0261,0.0000,0.0000,79.8754,11.1068,0.0000,0.0000,0.0000,0.0000,0.0000,0.0000,0.0000,0.0000,0.0000,0.0000,0.0000,0.0000,0.0000,0.0000,1.9940,0.0822,0.0000,0.0000,37.8862,1.5619,0.0000,0.0000,0.5354,0.0220,0.0000,0.0000,10.1728,0.4183,0.0000,0.0000
2020.75,288,59.1000,659.7467,102.6896,5.4047,0.0652,0.0096,0.0000,0.0000,622.8233,8.7450,0.0000,0.0000,622.8233,8.7450,0.0000,0.0000,0.0000,0.0000,0.0000,0.0000,6.5560,0.0921,0.0000,0.0000,26.2241,0.3682,0.0000,0.0000,0.0000,0.0000,0.0000,0.0000,0.0000,0.0000,0.0000,0.0000,44.2062,0.7017,0.0000,0.0000,0.4122,0.0167,0.0000,0.0000,0.0652,0.0096,0.0000,0.0000,622.8233,0.0000,0.0000,0.0000,0.0000,0.0000,0.0000,0.0000,0.0000,0.0000,0.0000,0.0000,3.7889,0.0591,0.0000,0.0000,71.9892,1.1238,0.0000,0.0000,0.8209,0.0132,0.0000,0.0000,15.5963,0.2508,0.0000,0.0000
2021.75,285,60.2000,214.0079,55.2689,2.9089,70.4712,10.2648,0.0000,0.0000,0.0000,0.0000,0.0000,0.0000,0.0000,0.0000,0.0000,0.0000,0.0000,0.0000,0.0000,0.0000,71.5390,2.2215,0.0000,0.0000,71.5390,2.2215,0.0000,0.0000,0.0000,0.0000,0.0000,0.0000,0.0000,0.0000,0.0000,0.0000,34.7995,0.6588,0.0000,0.0000,0.3008,0.0118,0.0000,0.0000,70.4712,10.2648,0.0000,0.0000,0.0000,0.0000,0.0000,0.0000,0.0000,0.0000,0.0000,0.0000,0.0000,0.0000,0.0000,0.0000,1.9534,0.0804,0.0000,0.0000,37.1152,1.5269,0.0000,0.0000,0.4884,0.0200,0.0000,0.0000,9.2799,0.3808,0.0000,0.0000
2022.75,288,59.1000,629.7429,103.9307,5.4700,0.0626,0.0090,0.0000,0.0000,595.5920,8.1803,0.0000,0.0000,595.5920,8.1803,0.0000,0.0000,0.0000,0.0000,0.0000,0.0000,6.2694,0.0861,0.0000,0.0000,25.0775,0.3444,0.0000,0.0000,0.0000,0.0000,0.0000,0.0000,0.0000,0.0000,0.0000,0.0000,28.8479,0.5318,0.0000,0.0000,0.2892,0.0118,0.0000,0.0000,0.0626,0.0090,0.0000,0.0000,595.5920,0.0000,0.0000,0.0000,0.0000,0.0000,0.0000,0.0000,0.0000,0.0000,0.0000,0.0000,3.3890,0.0515,0.0000,0.0000,64.3912,0.9777,0.0000,0.0000,0.9160,0.0145,0.0000,0.0000,17.4032,0.2752,0.0000,0.0000
2023.75,285,60.2000,157.0372,51.8192,2.7273,48.5504,8.0878,0.0000,0.0000,0.0000,0.0000,0.0000,0.0000,0.0000,0.0000,0.0000,0.0000,0.0000,0.0000,0.0000,0.0000,54.0234,1.9340,0.0000,0.0000,54.0234,1.9340,0.0000,0.0000,0.0000,0.0000,0.0000,0.0000,0.0000,0.0000,0.0000,0.0000,26.6381,0.4427,0.0000,0.0000,0.2195,0.0086,0.0000,0.0000,48.5504,8.0878,0.0000,0.0000,0.0000,0.0000,0.0000,0.0000,0.0000,0.0000,0.0000,0.0000,0.0000,0.0000,0.0000,0.0000,1.6287,0.0667,0.0000,0.0000,30.9455,1.2670,0.0000,0.0000,0.5047,0.0206,0.0000,0.0000,9.5898,0.3918,0.0000,0.0000
2024.75,288,59.1000,569.2836,96.2320,5.0648,0.0564,0.0082,0.0000,0.0000,537.3757,7.4777,0.0000,0.0000,537.3757,7.4777,0.0000,0.0000,0.0000,0.0000,0.0000,0.0000,5.6566,0.0787,0.0000,0.0000,22.6264,0.3149,0.0000,0.0000,0.0000,0.0000,0.0000,0.0000,0.0000,0.0000,0.0000,0.0000,11.6178,0.1972,0.0000,0.0000,0.1083,0.0043,0.0000,0.0000,0.0564,0.0082,0.0000,0.0000,537.3757,0.0000,0.0000,0.0000,0.0000,0.0000,0.0000,0.0000,0.0000,0.0000,0.0000,0.0000,3.3720,0.0504,0.0000,0.0000,64.0686,0.9573,0.0000,0.0000,0.8261,0.0128,0.0000,0.0000,15.6957,0.2428,0.0000,0.0000
2025.75,285,60.2000,174.5098,53.3925,2.8101,47.9471,8.1250,0.0000,0.0000,0.0000,0.0000,0.0000,0.0000,0.0000,0.0000,0.0000,0.0000,0.0000,0.0000,0.0000,0.0000,62.9430,2.3045,0.0000,0.0000,62.9430,2.3045,0.0000,0.0000,0.0000,0.0000,0.0000,0.0000,0.0000,0.0000,0.0000,0.0000,40.4166,0.7193,0.0000,0.0000,0.3358,0.0131,0.0000,0.0000,47.9471,8.1250,0.0000,0.0000,0.0000,0.0000,0.0000,0.0000,0.0000,0.0000,0.0000,0.0000,0.0000,0.0000,0.0000,0.0000,1.7142,0.0700,0.0000,0.0000,32.5703,1.3295,0.0000,0.0000,0.5122,0.0208,0.0000,0.0000,9.7323,0.3961,0.0000,0.0000
2026.75,288,59.1000,623.9089,103.7070,5.4583,0.0618,0.0087,0.0000,0.0000,589.7175,7.9328,0.0000,0.0000,589.7175,7.9328,0.0000,0.0000,0.0000,0.0000,0.0000,0.0000,6.2076,0.0835,0.0000,0.0000,24.8302,0.3340,0.0000,0.0000,0.0000,0.0000,0.0000,0.0000,0.0000,0.0000,0.0000,0.0000,30.1338,0.4388,0.0000,0.0000,0.2048,0.0082,0.0000,0.0000,0.0618,0.0087,0.0000,0.0000,589.7175,0.0000,0.0000,0.0000,0.0000,0.0000,0.0000,0.0000,0.0000,0.0000,0.0000,0.0000,3.8406,0.0577,0.0000,0.0000,72.9723,1.0960,0.0000,0.0000,0.8193,0.0127,0.0000,0.0000,15.5664,0.2420,0.0000,0.0000
2027.75,285,60.2000,220.6960,53.4882,2.8152,72.9275,10.3269,0.0000,0.0000,0.0000,0.0000,0.0000,0.0000,0.0000,0.0000,0.0000,0.0000,0.0000,0.0000,0.0000,0.0000,73.6523,2.2222,0.0000,0.0000,73.6523,2.2222,0.0000,0.0000,0.0000,0.0000,0.0000,0.0000,0.0000,0.0000,0.0000,0.0000,28.7221,0.5169,0.0000,0.0000,0.4297,0.0167,0.0000,0.0000,72.9275,10.3269,0.0000,0.0000,0.0000,0.0000,0.0000,0.0000,0.0000,0.0000,0.0000,0.0000,0.0000,0.0000,0.0000,0.0000,1.8435,0.0752,0.0000,0.0000,35.0272,1.4286,0.0000,0.0000,0.5039,0.0205,0.0000,0.0000,9.5745,0.3891,0.0000,0.0000
2028.75,288,59.1000,630.5941,109.6176,5.7694,0.0628,0.0084,0.0000,0.0000,596.2768,7.6773,0.0000,0.0000,596.2768,7.6773,0.0000,0.0000,0.0000,0.0000,0.0000,0.0000,6.2766,0.0808,0.0000,0.0000,25.1064,0.3233,0.0000,0.0000,0.0000,0.0000,0.0000,0.0000,0.0000,0.0000,0.0000,0.0000,21.2590,0.3525,0.0000,0.0000,0.1900,0.0075,0.0000,0.0000,0.0628,0.0084,0.0000,0.0000,596.2768,0.0000,0.0000,0.0000,0.0000,0.0000,0.0000,0.0000,0.0000,0.0000,0.0000,0.0000,3.9118,0.0561,0.0000,0.0000,74.3250,1.0660,0.0000,0.0000,0.9653,0.0144,0.0000,0.0000,18.3415,0.2737,0.0000,0.0000
2029.75,285,60.2000,149.4021,49.0209,2.5800,46.6506,7.8134,0.0000,0.0000,0.0000,0.0000,0.0000,0.0000,0.0000,0.0000,0.0000,0.0000,0.0000,0.0000,0.0000,0.0000,51.1656,1.8398,0.0000,0.0000,51.1656,1.8398,0.0000,0.0000,0.0000,0.0000,0.0000,0.0000,0.0000,0.0000,0.0000,0.0000,28.2967,0.3662,0.0000,0.0000,0.2061,0.0079,0.0000,0.0000,46.6506,7.8134,0.0000,0.0000,0.0000,0.0000,0.0000,0.0000,0.0000,0.0000,0.0000,0.0000,0.0000,0.0000,0.0000,0.0000,1.5403,0.0628,0.0000,0.0000,29.2653,1.1941,0.0000,0.0000,0.4857,0.0198,0.0000,0.0000,9.2275,0.3760,0.0000,0.0000
2030.75,288,59.1000,575.6039,104.5501,5.5026,0.0570,0.0074,0.0000,0.0000,543.5769,6.7653,0.0000,0.0000,543.5769,6.7653,0.0000,0.0000,0.0000,0.0000,0.0000,0.0000,5.7219,0.0712,0.0000,0.0000,22.8875,0.2849,0.0000,0.0000,0.0000,0.0000,0.0000,0.0000,0.0000,0.0000,0.0000,0.0000,27.4037,0.3230,0.0000,0.0000,0.2833,0.0112,0.0000,0.0000,0.0570,0.0074,0.0000,0.0000,543.5769,0.0000,0.0000,0.0000,0.0000,0.0000,0.0000,0.0000,0.0000,0.0000,0.0000,0.0000,3.7117,0.0520,0.0000,0.0000,70.5217,0.9880,0.0000,0.0000,0.9262,0.0134,0.0000,0.0000,17.5976,0.2553,0.0000,0.0000
