time,dayofyr,crpval,agcacc,bgcjacc,bgcmacc,cgrain,egrain(N),egrain(P),egrain(S),crmvst,ermvst(N),ermvst(P),ermvst(S),cstraw,estraw(N),estraw(P),estraw(S),stdstraw,estdstraw(N),estdstraw(P),estdstraw(S),addsdc,addsde(N),addsde(P),addsde(S),resid,reside(N),reside(P),reside(S),irrapp,fertapp(N),fertapp(P),fertapp(S),omadapp,omaeapp(N),omaeapp(P),omaeapp(S),strmac(1),strmac(2),strmac(3),strmac(4),strmac(5),strmac(6),strmac(7),strmac(8),cgracc,egracc(N),egracc(P),egracc(S),accrst,accrste(N),accrste(P),accrste(S),ctubesj,etubesj(N),etubesj(P),etubesj(S),ctubesm,etubesm(N),etubesm(P),etubesm(S),srfclittrj,srfclittrj(N),esrfclittrj(P),esrfclittrj(S),soillittrj,esoillittrj(N),esoillittrj(P),esoillittrj(S),srfclittrm,esrfclittrm(N),esrfclittrm(P),esrfclittrm(S),soillittrm,esoillittrm(N),esoillittrm(P),esoillittrm(S)
2008.75,302,3.1000,876.7198,291.0782,15.3199,518.0341,13.8467,0.0000,0.0000,321.9158,3.6028,0.0000,0.0000,321.9158,3.6028,0.0000,0.0000,0.0000,0.0000,0.0000,0.0000,17.8842,0.2002,0.0000,0.0000,17.8842,0.2002,0.0000,0.0000,0.0000,16.8000,0.0000,0.0000,0.0000,0.0000,0.0000,0.0000,37.0725,0.8032,0.0000,0.0000,0.6425,0.0295,0.0000,0.0000,518.0341,13.8467,0.0000,0.0000,321.9158,0.0000,0.0000,0.0000,0.0000,0.0000,0.0000,0.0000,0.0000,0.0000,0.0000,0.0000,10.1887,0.2197,0.0000,0.0000,193.5855,4.1738,0.0000,0.0000,2.4576,0.0538,0.0000,0.0000,46.6938,1.0230,0.0000,0.0000
2009.83,307,3.1000,823.3663,298.4262,15.7067,493.1036,13.2699,0.0000,0.0000,295.8622,3.3440,0.0000,0.0000,295.8622,3.3440,0.0000,0.0000,0.0000,0.0000,0.0000,0.0000,16.4368,0.1858,0.0000,0.0000,16.4368,0.1858,0.0000,0.0000,0.0000,20.2000,0.0000,0.0000,0.0000,0.0000,0.0000,0.0000,37.6955,1.2286,0.0000,0.0000,0.6763,0.0297,0.0000,0.0000,493.1036,13.2699,0.0000,0.0000,295.8622,0.0000,0.0000,0.0000,0.0000,0.0000,0.0000,0.0000,0.0000,0.0000,0.0000,0.0000,10.3899,0.2234,0.0000,0.0000,197.4081,4.2443,0.0000,0.0000,2.4768,0.0541,0.0000,0.0000,47.0601,1.0273,0.0000,0.0000
2010.75,285,60.2000,201.1620,60.5099,3.1847,65.9980,9.9393,0.0000,0.0000,0.0000,0.0000,0.0000,0.0000,0.0000,0.0000,0.0000,0.0000,0.0000,0.0000,0.0000,0.0000,67.2000,2.1582,0.0000,0.0000,67.2000,2.1582,0.0000,0.0000,0.0000,0.0000,0.0000,0.0000,0.0000,0.0000,0.0000,0.0000,31.5334,1.0396,0.0000,0.0000,0.7674,0.0328,0.0000,0.0000,65.9980,9.9393,0.0000,0.0000,0.0000,0.0000,0.0000,0.0000,0.0000,0.0000,0.0000,0.0000,0.0000,0.0000,0.0000,0.0000,1.9530,0.0807,0.0000,0.0000,37.1065,1.5337,0.0000,0.0000,0.5761,0.0237,0.0000,0.0000,10.9464,0.4508,0.0000,0.0000
2012.92,350,44.2000,431.0194,110.6781,5.8252,0.0000,0.0000,0.0000,0.0000,288.7208,0.9019,0.0000,0.0000,0.0595,0.0029,0.0000,0.0000,288.6613,0.8991,0.0000,0.0000,0.0000,0.0000,0.0000,0.0000,0.0000,0.0000,0.0000,0.0000,0.0000,2.3000,0.0000,0.0000,0.0000,0.0000,0.0000,0.0000,4.4586,0.1159,0.0000,0.0000,0.1690,0.0079,0.0000,0.0000,0.0000,0.0000,0.0000,0.0000,288.7208,0.9019,0.0000,0.0000,0.0000,0.0000,0.0000,0.0000,0.0000,0.0000,0.0000,0.0000,0.6800,0.0170,0.0000,0.0000,4.1773,0.1044,0.0000,0.0000,0.5087,0.0127,0.0000,0.0000,3.1251,0.0781,0.0000,0.0000
2013.92,350,44.3000,1020.7787,327.5023,17.2370,0.0000,0.0000,0.0000,0.0000,666.4733,1.3195,0.0000,0.0000,0.2021,0.0092,0.0000,0.0000,666.2712,1.3103,0.0000,0.0000,0.0000,0.0000,0.0000,0.0000,0.0000,0.0000,0.0000,0.0000,0.0000,2.3000,0.0000,0.0000,0.0000,0.0000,0.0000,0.0000,28.8420,0.3131,0.0000,0.0000,0.2503,0.0116,0.0000,0.0000,0.0000,0.0000,0.0000,0.0000,666.4733,1.3195,0.0000,0.0000,0.0000,0.0000,0.0000,0.0000,0.0000,0.0000,0.0000,0.0000,2.1685,0.0463,0.0000,0.0000,13.3207,0.2846,0.0000,0.0000,1.3853,0.0314,0.0000,0.0000,8.5094,0.1930,0.0000,0.0000
2014.92,350,44.4000,1083.1707,363.6563,19.1398,0.0000,0.0000,0.0000,0.0000,720.3669,1.3808,0.0000,0.0000,6.7904,0.1351,0.0000,0.0000,713.5766,1.2456,0.0000,0.0000,0.0000,0.0000,0.0000,0.0000,0.0000,0.0000,0.0000,0.0000,0.0000,2.3000,0.0000,0.0000,0.0000,0.0000,0.0000,0.0000,16.5853,0.0635,0.0000,0.0000,0.2999,0.0127,0.0000,0.0000,0.0000,0.0000,0.0000,0.0000,720.3669,1.3808,0.0000,0.0000,0.0000,0.0000,0.0000,0.0000,0.0000,0.0000,0.0000,0.0000,2.6998,0.0554,0.0000,0.0000,16.5843,0.3406,0.0000,0.0000,2.2008,0.0477,0.0000,0.0000,13.5193,0.2933,0.0000,0.0000
2015.92,350,44.5000,784.0343,245.1799,12.9042,0.0000,0.0000,0.0000,0.0000,527.1334,1.2559,0.0000,0.0000,5.0283,0.1251,0.0000,0.0000,522.1050,1.1308,0.0000,0.0000,0.0000,0.0000,0.0000,0.0000,0.0000,0.0000,0.0000,0.0000,0.0000,2.3000,0.0000,0.0000,0.0000,0.0000,0.0000,0.0000,20.1557,0.0230,0.0000,0.0000,0.4652,0.0190,0.0000,0.0000,0.0000,0.0000,0.0000,0.0000,527.1334,1.2559,0.0000,0.0000,0.0000,0.0000,0.0000,0.0000,0.0000,0.0000,0.0000,0.0000,2.0045,0.0428,0.0000,0.0000,12.3135,0.2629,0.0000,0.0000,2.5270,0.0547,0.0000,0.0000,15.5231,0.3363,0.0000,0.0000
2016.75,296,3.1000,1059.6769,353.5905,18.6100,634.9596,15.9156,0.0000,0.0000,380.9757,4.0107,0.0000,0.0000,380.9757,4.0107,0.0000,0.0000,0.0000,0.0000,0.0000,0.0000,21.1653,0.2228,0.0000,0.0000,21.1653,0.2228,0.0000,0.0000,0.0000,20.2000,0.0000,0.0000,0.0000,0.0000,0.0000,0.0000,21.3907,0.0114,0.0000,0.0000,0.2770,0.0119,0.0000,0.0000,634.9596,15.9156,0.0000,0.0000,380.9757,0.0000,0.0000,0.0000,0.0000,0.0000,0.0000,0.0000,0.0000,0.0000,0.0000,0.0000,13.9527,0.2981,0.0000,0.0000,265.1006,5.6632,0.0000,0.0000,10.8273,0.2348,0.0000,0.0000,205.7178,4.4609,0.0000,0.0000
2017.75,285,60.2000,149.2612,49.6745,2.6144,47.2755,7.9766,0.0000,0.0000,0.0000,0.0000,0.0000,0.0000,0.0000,0.0000,0.0000,0.0000,0.0000,0.0000,0.0000,0.0000,50.7997,1.8372,0.0000,0.0000,50.7997,1.8372,0.0000,0.0000,0.0000,0.0000,0.0000,0.0000,0.0000,0.0000,0.0000,0.0000,29.3733,0.1317,0.0000,0.0000,0.5439,0.0218,0.0000,0.0000,47.2755,7.9766,0.0000,0.0000,0.0000,0.0000,0.0000,0.0000,0.0000,0.0000,0.0000,0.0000,0.0000,0.0000,0.0000,0.0000,1.6036,0.0660,0.0000,0.0000,30.4690,1.2534,0.0000,0.0000,0.4742,0.0195,0.0000,0.0000,9.0095,0.3699,0.0000,0.0000
2018.75,288,59.1000,892.5329,122.6207,6.4537,0.0887,0.0142,0.0000,0.0000,844.4485,12.9782,0.0000,0.0000,844.4485,12.9782,0.0000,0.0000,0.0000,0.0000,0.0000,0.0000,8.8889,0.1366,0.0000,0.0000,35.5557,0.5465,0.0000,0.0000,0.0000,5.6000,0.0000,0.0000,0.0000,0.0000,0.0000,0.0000,27.2145,0.2674,0.0000,0.0000,0.5877,0.0251,0.0000,0.0000,0.0887,0.0142,0.0000,0.0000,844.4485,0.0000,0.0000,0.0000,0.0000,0.0000,0.0000,0.0000,0.0000,0.0000,0.0000,0.0000,4.3995,0.0768,0.0000,0.0000,83.5902,1.4586,0.0000,0.0000,1.0647,0.0197,0.0000,0.0000,20.2290,0.3739,0.0000,0.0000
2019.75,285,60.2000,245.0452,58.2323,3.0649,80.9708,11.2287,0.0000,0.0000,0.0000,0.0000,0.0000,0.0000,0.0000,0.0000,0.0000,0.0000,0.0000,0.0000,0.0000,0.0000,81.7851,2.4166,0.0000,0.0000,81.7851,2.4166,0.0000,0.0000,0.0000,0.0000,0.0000,0.0000,0.0000,0.0000,0.0000,0.0000,48.0181,0.5433,0.0000,0.0000,0.6606,0.0270,0.0000,0.0000,80.9708,11.2287,0.0000,0.0000,0.0000,0.0000,0.0000,0.0000,0.0000,0.0000,0.0000,0.0000,0.0000,0.0000,0.0000,0.0000,2.0220,0.0835,0.0000,0.0000,38.4174,1.5865,0.0000,0.0000,0.5408,0.0223,0.0000,0.0000,10.2749,0.4235,0.0000,0.0000
2020.75,288,59.1000,798.7456,109.0380,5.7388,0.0791,0.0134,0.0000,0.0000,754.8085,12.2482,0.0000,0.0000,754.8085,12.2482,0.0000,0.0000,0.0000,0.0000,0.0000,0.0000,7.9453,0.1289,0.0000,0.0000,31.7814,0.5157,0.0000,0.0000,0.0000,5.6000,0.0000,0.0000,0.0000,0.0000,0.0000,0.0000,44.1904,0.7828,0.0000,0.0000,0.4116,0.0177,0.0000,0.0000,0.0791,0.0134,0.0000,0.0000,754.8085,0.0000,0.0000,0.0000,0.0000,0.0000,0.0000,0.0000,0.0000,0.0000,0.0000,0.0000,4.0139,0.0720,0.0000,0.0000,76.2645,1.3687,0.0000,0.0000,0.8748,0.0167,0.0000,0.0000,16.6212,0.3171,0.0000,0.0000
2021.75,285,60.2000,218.0415,56.1130,2.9533,71.7963,10.4202,0.0000,0.0000,0.0000,0.0000,0.0000,0.0000,0.0000,0.0000,0.0000,0.0000,0.0000,0.0000,0.0000,0.0000,72.8841,2.2551,0.0000,0.0000,72.8841,2.2551,0.0000,0.0000,0.0000,0.0000,0.0000,0.0000,0.0000,0.0000,0.0000,0.0000,34.8982,0.7467,0.0000,0.0000,0.3056,0.0126,0.0000,0.0000,71.7963,10.4202,0.0000,0.0000,0.0000,0.0000,0.0000,0.0000,0.0000,0.0000,0.0000,0.0000,0.0000,0.0000,0.0000,0.0000,1.9871,0.0819,0.0000,0.0000,37.7546,1.5564,0.0000,0.0000,0.4936,0.0203,0.0000,0.0000,9.3786,0.3857,0.0000,0.0000
2022.75,288,59.1000,782.4391,109.7827,5.7780,0.0779,0.0131,0.0000,0.0000,740.5942,11.9062,0.0000,0.0000,740.5942,11.9062,0.0000,0.0000,0.0000,0.0000,0.0000,0.0000,7.7957,0.1253,0.0000,0.0000,31.1829,0.5013,0.0000,0.0000,0.0000,5.6000,0.0000,0.0000,0.0000,0.0000,0.0000,0.0000,28.7271,0.6210,0.0000,0.0000,0.2869,0.0124,0.0000,0.0000,0.0779,0.0131,0.0000,0.0000,740.5942,0.0000,0.0000,0.0000,0.0000,0.0000,0.0000,0.0000,0.0000,0.0000,0.0000,0.0000,3.5833,0.0625,0.0000,0.0000,68.0820,1.1876,0.0000,0.0000,0.9649,0.0182,0.0000,0.0000,18.3335,0.3452,0.0000,0.0000
2023.75,285,60.2000,161.6750,53.1874,2.7993,49.8949,8.2880,0.0000,0.0000,0.0000,0.0000,0.0000,0.0000,0.0000,0.0000,0.0000,0.0000,0.0000,0.0000,0.0000,0.0000,55.6596,1.9872,0.0000,0.0000,55.6596,1.9872,0.0000,0.0000,0.0000,0.0000,0.0000,0.0000,0.0000,0.0000,0.0000,0.0000,26.6855,0.5316,0.0000,0.0000,0.2233,0.0092,0.0000,0.0000,49.8949,8.2880,0.0000,0.0000,0.0000,0.0000,0.0000,0.0000,0.0000,0.0000,0.0000,0.0000,0.0000,0.0000,0.0000,0.0000,1.6746,0.0688,0.0000,0.0000,31.8178,1.3072,0.0000,0.0000,0.5155,0.0211,0.0000,0.0000,9.7939,0.4017,0.0000,0.0000
2024.75,288,59.1000,725.2221,107.8954,5.6787,0.0720,0.0122,0.0000,0.0000,685.4092,11.1035,0.0000,0.0000,685.4092,11.1035,0.0000,0.0000,0.0000,0.0000,0.0000,0.0000,7.2148,0.1169,0.0000,0.0000,28.8593,0.4675,0.0000,0.0000,0.0000,5.6000,0.0000,0.0000,0.0000,0.0000,0.0000,0.0000,11.6374,0.2402,0.0000,0.0000,0.1106,0.0047,0.0000,0.0000,0.0720,0.0122,0.0000,0.0000,685.4092,0.0000,0.0000,0.0000,0.0000,0.0000,0.0000,0.0000,0.0000,0.0000,0.0000,0.0000,3.7506,0.0655,0.0000,0.0000,71.2613,1.2442,0.0000,0.0000,0.9362,0.0176,0.0000,0.0000,17.7876,0.3353,0.0000,0.0000
2025.75,285,60.2000,180.8819,54.8434,2.8865,49.6705,8.3733,0.0000,0.0000,0.0000,0.0000,0.0000,0.0000,0.0000,0.0000,0.0000,0.0000,0.0000,0.0000,0.0000,0.0000,65.2576,2.3768,0.0000,0.0000,65.2576,2.3768,0.0000,0.0000,0.0000,0.0000,0.0000,0.0000,0.0000,0.0000,0.0000,0.0000,40.4424,0.8881,0.0000,0.0000,0.3481,0.0143,0.0000,0.0000,49.6705,8.3733,0.0000,0.0000,0.0000,0.0000,0.0000,0.0000,0.0000,0.0000,0.0000,0.0000,0.0000,0.0000,0.0000,0.0000,1.7658,0.0724,0.0000,0.0000,33.5500,1.3749,0.0000,0.0000,0.5222,0.0213,0.0000,0.0000,9.9217,0.4056,0.0000,0.0000
2026.75,288,59.1000,783.9465,109.6913,5.7732,0.0777,0.0130,0.0000,0.0000,741.6617,11.8752,0.0000,0.0000,741.6617,11.8752,0.0000,0.0000,0.0000,0.0000,0.0000,0.0000,7.8070,0.1250,0.0000,0.0000,31.2279,0.5000,0.0000,0.0000,0.0000,5.6000,0.0000,0.0000,0.0000,0.0000,0.0000,0.0000,30.1216,0.5414,0.0000,0.0000,0.2086,0.0089,0.0000,0.0000,0.0777,0.0130,0.0000,0.0000,741.6617,0.0000,0.0000,0.0000,0.0000,0.0000,0.0000,0.0000,0.0000,0.0000,0.0000,0.0000,4.0659,0.0711,0.0000,0.0000,77.2518,1.3504,0.0000,0.0000,0.8640,0.0162,0.0000,0.0000,16.4156,0.3072,0.0000,0.0000
2027.75,285,60.2000,229.4569,55.2074,2.9057,75.8269,10.6542,0.0000,0.0000,0.0000,0.0000,0.0000,0.0000,0.0000,0.0000,0.0000,0.0000,0.0000,0.0000,0.0000,0.0000,76.5728,2.2924,0.0000,0.0000,76.5728,2.2924,0.0000,0.0000,0.0000,0.0000,0.0000,0.0000,0.0000,0.0000,0.0000,0.0000,28.7213,0.6722,0.0000,0.0000,0.4420,0.0179,0.0000,0.0000,75.8269,10.6542,0.0000,0.0000,0.0000,0.0000,0.0000,0.0000,0.0000,0.0000,0.0000,0.0000,0.0000,0.0000,0.0000,0.0000,1.9105,0.0783,0.0000,0.0000,36.2994,1.4872,0.0000,0.0000,0.5161,0.0211,0.0000,0.0000,9.8050,0.4006,0.0000,0.0000
2028.75,288,59.1000,810.8565,120.0598,6.3189,0.0808,0.0129,0.0000,0.0000,767.4421,11.7402,0.0000,0.0000,767.4421,11.7402,0.0000,0.0000,0.0000,0.0000,0.0000,0.0000,8.0783,0.1236,0.0000,0.0000,32.3134,0.4943,0.0000,0.0000,0.0000,5.6000,0.0000,0.0000,0.0000,0.0000,0.0000,0.0000,21.1852,0.4467,0.0000,0.0000,0.1938,0.0081,0.0000,0.0000,0.0808,0.0129,0.0000,0.0000,767.4421,0.0000,0.0000,0.0000,0.0000,0.0000,0.0000,0.0000,0.0000,0.0000,0.0000,0.0000,4.2812,0.0713,0.0000,0.0000,81.3427,1.3538,0.0000,0.0000,1.0579,0.0191,0.0000,0.0000,20.0996,0.3635,0.0000,0.0000
2029.75,285,60.2000,154.7422,50.5645,2.6613,48.3136,8.0577,0.0000,0.0000,0.0000,0.0000,0.0000,0.0000,0.0000,0.0000,0.0000,0.0000,0.0000,0.0000,0.0000,0.0000,52.9969,1.8976,0.0000,0.0000,52.9969,1.8976,0.0000,0.0000,0.0000,0.0000,0.0000,0.0000,0.0000,0.0000,0.0000,0.0000,28.3659,0.4967,0.0000,0.0000,0.2150,0.0085,0.0000,0.0000,48.3136,8.0577,0.0000,0.0000,0.0000,0.0000,0.0000,0.0000,0.0000,0.0000,0.0000,0.0000,0.0000,0.0000,0.0000,0.0000,1.5931,0.0653,0.0000,0.0000,30.2682,1.2401,0.0000,0.0000,0.4971,0.0203,0.0000,0.0000,9.4440,0.3866,0.0000,0.0000
2030.75,288,59.1000,744.5219,113.4972,5.9735,0.0739,0.0118,0.0000,0.0000,703.9382,10.7255,0.0000,0.0000,703.9382,10.7255,0.0000,0.0000,0.0000,0.0000,0.0000,0.0000,7.4099,0.1129,0.0000,0.0000,29.6395,0.4516,0.0000,0.0000,0.0000,5.6000,0.0000,0.0000,0.0000,0.0000,0.0000,0.0000,27.1641,0.4220,0.0000,0.0000,0.2838,0.0120,0.0000,0.0000,0.0739,0.0118,0.0000,0.0000,703.9382,0.0000,0.0000,0.0000,0.0000,0.0000,0.0000,0.0000,0.0000,0.0000,0.0000,0.0000,4.0355,0.0657,0.0000,0.0000,76.6745,1.2478,0.0000,0.0000,1.0016,0.0177,0.0000,0.0000,19.0313,0.3359,0.0000,0.0000
