Incubation_replication,Incubation_date,Fertilization_level,Planting_year,Plot,Respiration_day
1,7/24/2019,100,2017,31,3.289058172
1,7/24/2019,100,2017,31,2.792396578
1,7/24/2019,300,2017,32,5.735445329
1,7/24/2019,300,2017,32,4.727237568
1,7/24/2019,200,2017,33,6.704206109
1,7/24/2019,0,2017,35,6.15838859
1,7/24/2019,0,2017,35,4.897153353
1,7/24/2019,100,2016,36,2.871871849
1,7/24/2019,100,2016,36,5.165877956
1,7/24/2019,300,2016,38,6.820371251
1,7/24/2019,300,2016,38,7.005056959
1,7/24/2019,0,2016,39,3.554163153
1,7/24/2019,0,2016,39,4.332253968
1,7/24/2019,200,2016,40,7.200567135
1,7/24/2019,200,2016,40,8.43363057
1,7/24/2019,100,2015,41,6.249783359
1,7/24/2019,100,2015,41,8.185370196
1,7/24/2019,300,2015,42,6.138113841
1,7/24/2019,300,2015,42,5.871902354
1,7/24/2019,200,2015,43,5.542703181
1,7/24/2019,200,2015,43,6.569269824
1,7/24/2019,0,2015,44,3.686767303
1,7/24/2019,0,2015,44,3.437043283
1,7/24/2019,0,2017,46,3.601817597
1,7/24/2019,0,2017,46,3.790477076
1,7/24/2019,300,2017,47,6.114035472
1,7/24/2019,300,2017,47,6.980072391
1,7/24/2019,100,2017,49,5.873956932
1,7/24/2019,100,2017,49,4.223781163
1,7/24/2019,200,2017,50,3.767705256
1,7/24/2019,200,2017,50,4.489447376
1,7/24/2019,300,2015,51,3.004563959
1,7/24/2019,300,2015,51,5.375871625
1,7/24/2019,100,2015,52,4.467766548
1,7/24/2019,100,2015,52,6.969014035
1,7/24/2019,200,2015,54,4.673349545
1,7/24/2019,200,2015,54,7.076557656
1,7/24/2019,0,2015,55,3.700277411
1,7/24/2019,0,2015,55,3.668746319
1,7/24/2019,0,2016,56,3.808773244
1,7/24/2019,0,2016,56,5.211304126
1,7/24/2019,300,2016,57,4.565860227
1,7/24/2019,300,2016,57,5.422504824
1,7/24/2019,100,2016,59,4.729160325
1,7/24/2019,100,2016,59,4.826203705
1,7/24/2019,200,2016,60,3.136455117
1,7/24/2019,200,2016,60,4.561479837
2,7/25/2019,100,2015,1,4.832257885
2,7/25/2019,100,2015,1,1.976224963
2,7/25/2019,300,2015,2,5.568154263
2,7/25/2019,300,2015,2,5.446637515
2,7/25/2019,0,2015,4,3.823583551
2,7/25/2019,0,2015,4,5.261465368
2,7/25/2019,200,2015,5,4.750225596
2,7/25/2019,200,2015,5,5.265481568
2,7/25/2019,0,2016,7,3.412473267
2,7/25/2019,0,2016,7,3.573906803
2,7/25/2019,300,2016,8,6.183642389
2,7/25/2019,300,2016,8,1.305928394
2,7/25/2019,200,2016,9,4.347949335
2,7/25/2019,200,2016,9,6.212228401
2,7/25/2019,100,2016,10,6.006325355
2,7/25/2019,100,2016,10,6.041615163
2,7/25/2019,300,2017,11,7.158738371
2,7/25/2019,300,2017,11,5.35843008
2,7/25/2019,200,2017,12,9.517320934
2,7/25/2019,200,2017,12,7.382509371
2,7/25/2019,0,2017,14,4.654363074
2,7/25/2019,0,2017,14,3.626342848
2,7/25/2019,100,2017,15,4.504081132
2,7/25/2019,100,2017,15,5.484036194
2,7/25/2019,200,2016,18,4.096151143
2,7/25/2019,200,2016,18,6.594668725
3,8/6/2019,100,2017,31,7.550370356
3,8/6/2019,100,2017,31,7.586460707
3,8/6/2019,300,2017,32,4.433622866
3,8/6/2019,300,2017,32,5.025702326
3,8/6/2019,200,2017,33,6.65101638
3,8/6/2019,200,2017,33,11.00924233
3,8/6/2019,0,2017,35,7.712599971
3,8/6/2019,0,2017,35,7.850584477
3,8/6/2019,100,2016,36,4.424863401
3,8/6/2019,100,2016,36,5.121802504
3,8/6/2019,300,2016,38,4.999070906
3,8/6/2019,300,2016,38,5.224942548
3,8/6/2019,0,2016,39,3.394271853
3,8/6/2019,0,2016,39,3.47015363
3,8/6/2019,100,2015,41,7.229459461
3,8/6/2019,300,2015,42,6.126158189
3,8/6/2019,300,2015,42,6.291009841
3,8/6/2019,200,2015,43,5.604824015
3,8/6/2019,200,2015,43,6.188238996
3,8/6/2019,0,2015,44,3.607848254
3,8/6/2019,0,2015,44,5.849826995
3,8/6/2019,0,2017,46,4.290776892
3,8/6/2019,0,2017,46,5.647484543
3,8/6/2019,300,2017,47,9.030879925
3,8/6/2019,300,2017,47,10.33348321
3,8/6/2019,100,2017,49,7.475030938
3,8/6/2019,100,2017,49,7.571901997
3,8/6/2019,200,2017,50,7.269560289
3,8/6/2019,200,2017,50,7.483406554
3,8/6/2019,300,2015,51,7.501355155
3,8/6/2019,300,2015,51,7.752345931
3,8/6/2019,100,2015,52,6.119483947
3,8/6/2019,100,2015,52,6.589496968
3,8/6/2019,200,2015,54,5.38988061
3,8/6/2019,200,2015,54,6.418682843
3,8/6/2019,0,2015,55,3.339947209
3,8/6/2019,0,2015,55,3.613602444
3,8/6/2019,0,2016,56,3.12002875
3,8/6/2019,0,2016,56,4.247367344
3,8/6/2019,300,2016,57,6.661013428
3,8/6/2019,100,2016,59,6.443344018
3,8/6/2019,100,2016,59,6.737174042
3,8/6/2019,200,2016,60,8.737501273
3,8/6/2019,200,2016,60,8.763100182
4,8/7/2019,100,2015,1,4.159226994
4,8/7/2019,100,2015,1,4.25243096
4,8/7/2019,300,2015,2,5.432524018
4,8/7/2019,300,2015,2,6.582476427
4,8/7/2019,0,2015,4,2.271149043
4,8/7/2019,0,2015,4,3.012271272
4,8/7/2019,200,2015,5,6.180154851
4,8/7/2019,200,2015,5,6.245442438
4,8/7/2019,0,2016,7,2.778315912
4,8/7/2019,0,2016,7,3.923219923
4,8/7/2019,300,2016,8,4.981217081
4,8/7/2019,300,2016,8,4.997936511
4,8/7/2019,100,2016,10,3.894780266
4,8/7/2019,100,2016,10,6.410068344
4,8/7/2019,300,2017,11,5.331298789
4,8/7/2019,300,2017,11,5.749224796
4,8/7/2019,200,2017,12,5.325540843
4,8/7/2019,200,2017,12,5.885477367
4,8/7/2019,0,2017,14,3.632806928
4,8/7/2019,0,2017,14,4.779675335
4,8/7/2019,100,2017,15,3.590098911
4,8/7/2019,100,2017,15,5.700526443
4,8/7/2019,100,2016,16,2.587576535
4,8/7/2019,100,2016,16,3.002453025
4,8/7/2019,200,2016,18,5.40710591
4,8/7/2019,200,2016,18,6.383956749
4,8/7/2019,0,2016,19,4.624025402
4,8/7/2019,0,2016,19,5.251011193
4,8/7/2019,300,2016,20,3.862616218
4,8/7/2019,300,2016,20,4.557812133
4,8/7/2019,300,2017,21,3.725851621
4,8/7/2019,300,2017,21,4.999725764
4,8/7/2019,100,2017,23,3.998415307
4,8/7/2019,100,2017,23,4.025861319
4,8/7/2019,0,2017,24,3.505158519
4,8/7/2019,0,2017,24,4.488510705
4,8/7/2019,200,2017,25,5.208970124
4,8/7/2019,200,2017,25,5.796879991
4,8/7/2019,100,2015,26,3.281995788
4,8/7/2019,100,2015,26,6.328494158
4,8/7/2019,0,2015,28,1.788227449
4,8/7/2019,0,2015,28,3.175950258
4,8/7/2019,300,2015,29,4.096721862
4,8/7/2019,300,2015,29,7.421225445
4,8/7/2019,200,2015,30,4.298441976
4,8/7/2019,200,2015,30,5.18859933
