time,dayofyr,crpval,agcacc,bgcjacc,bgcmacc,cgrain,egrain(N),egrain(P),egrain(S),crmvst,ermvst(N),ermvst(P),ermvst(S),cstraw,estraw(N),estraw(P),estraw(S),stdstraw,estdstraw(N),estdstraw(P),estdstraw(S),addsdc,addsde(N),addsde(P),addsde(S),resid,reside(N),reside(P),reside(S),irrapp,fertapp(N),fertapp(P),fertapp(S),omadapp,omaeapp(N),omaeapp(P),omaeapp(S),strmac(1),strmac(2),strmac(3),strmac(4),strmac(5),strmac(6),strmac(7),strmac(8),cgracc,egracc(N),egracc(P),egracc(S),accrst,accrste(N),accrste(P),accrste(S),ctubesj,etubesj(N),etubesj(P),etubesj(S),ctubesm,etubesm(N),etubesm(P),etubesm(S),srfclittrj,srfclittrj(N),esrfclittrj(P),esrfclittrj(S),soillittrj,esoillittrj(N),esoillittrj(P),esoillittrj(S),srfclittrm,esrfclittrm(N),esrfclittrm(P),esrfclittrm(S),soillittrm,esoillittrm(N),esoillittrm(P),esoillittrm(S)
2008.75,302,3.1000,876.7198,291.0782,15.3199,518.0341,13.8467,0.0000,0.0000,321.9158,3.6028,0.0000,0.0000,321.9158,3.6028,0.0000,0.0000,0.0000,0.0000,0.0000,0.0000,17.8842,0.2002,0.0000,0.0000,17.8842,0.2002,0.0000,0.0000,0.0000,16.8000,0.0000,0.0000,0.0000,0.0000,0.0000,0.0000,37.0725,0.8032,0.0000,0.0000,0.6425,0.0295,0.0000,0.0000,518.0341,13.8467,0.0000,0.0000,321.9158,0.0000,0.0000,0.0000,0.0000,0.0000,0.0000,0.0000,0.0000,0.0000,0.0000,0.0000,10.1887,0.2197,0.0000,0.0000,193.5855,4.1738,0.0000,0.0000,2.4576,0.0538,0.0000,0.0000,46.6938,1.0230,0.0000,0.0000
2009.83,307,3.1000,823.3663,298.4262,15.7067,493.1036,13.2699,0.0000,0.0000,295.8622,3.3440,0.0000,0.0000,295.8622,3.3440,0.0000,0.0000,0.0000,0.0000,0.0000,0.0000,16.4368,0.1858,0.0000,0.0000,16.4368,0.1858,0.0000,0.0000,0.0000,20.2000,0.0000,0.0000,0.0000,0.0000,0.0000,0.0000,37.6955,1.2286,0.0000,0.0000,0.6763,0.0297,0.0000,0.0000,493.1036,13.2699,0.0000,0.0000,295.8622,0.0000,0.0000,0.0000,0.0000,0.0000,0.0000,0.0000,0.0000,0.0000,0.0000,0.0000,10.3899,0.2234,0.0000,0.0000,197.4081,4.2443,0.0000,0.0000,2.4768,0.0541,0.0000,0.0000,47.0601,1.0273,0.0000,0.0000
2010.75,285,60.2000,201.1620,60.5099,3.1847,65.9980,9.9393,0.0000,0.0000,0.0000,0.0000,0.0000,0.0000,0.0000,0.0000,0.0000,0.0000,0.0000,0.0000,0.0000,0.0000,67.2000,2.1582,0.0000,0.0000,67.2000,2.1582,0.0000,0.0000,0.0000,0.0000,0.0000,0.0000,0.0000,0.0000,0.0000,0.0000,31.5334,1.0396,0.0000,0.0000,0.7674,0.0328,0.0000,0.0000,65.9980,9.9393,0.0000,0.0000,0.0000,0.0000,0.0000,0.0000,0.0000,0.0000,0.0000,0.0000,0.0000,0.0000,0.0000,0.0000,1.9530,0.0807,0.0000,0.0000,37.1065,1.5337,0.0000,0.0000,0.5761,0.0237,0.0000,0.0000,10.9464,0.4508,0.0000,0.0000
2012.92,350,44.2000,431.0194,110.6781,5.8252,0.0000,0.0000,0.0000,0.0000,288.7208,0.9019,0.0000,0.0000,0.0595,0.0029,0.0000,0.0000,288.6613,0.8991,0.0000,0.0000,0.0000,0.0000,0.0000,0.0000,0.0000,0.0000,0.0000,0.0000,0.0000,2.3000,0.0000,0.0000,0.0000,0.0000,0.0000,0.0000,4.4586,0.1159,0.0000,0.0000,0.1690,0.0079,0.0000,0.0000,0.0000,0.0000,0.0000,0.0000,288.7208,0.9019,0.0000,0.0000,0.0000,0.0000,0.0000,0.0000,0.0000,0.0000,0.0000,0.0000,0.6800,0.0170,0.0000,0.0000,4.1773,0.1044,0.0000,0.0000,0.5087,0.0127,0.0000,0.0000,3.1251,0.0781,0.0000,0.0000
2013.92,350,44.3000,1020.7787,327.5023,17.2370,0.0000,0.0000,0.0000,0.0000,666.4733,1.3195,0.0000,0.0000,0.2021,0.0092,0.0000,0.0000,666.2712,1.3103,0.0000,0.0000,0.0000,0.0000,0.0000,0.0000,0.0000,0.0000,0.0000,0.0000,0.0000,2.3000,0.0000,0.0000,0.0000,0.0000,0.0000,0.0000,28.8420,0.3131,0.0000,0.0000,0.2503,0.0116,0.0000,0.0000,0.0000,0.0000,0.0000,0.0000,666.4733,1.3195,0.0000,0.0000,0.0000,0.0000,0.0000,0.0000,0.0000,0.0000,0.0000,0.0000,2.1685,0.0463,0.0000,0.0000,13.3207,0.2846,0.0000,0.0000,1.3853,0.0314,0.0000,0.0000,8.5094,0.1930,0.0000,0.0000
2014.92,350,44.4000,1083.1707,363.6563,19.1398,0.0000,0.0000,0.0000,0.0000,720.3669,1.3808,0.0000,0.0000,6.7904,0.1351,0.0000,0.0000,713.5766,1.2456,0.0000,0.0000,0.0000,0.0000,0.0000,0.0000,0.0000,0.0000,0.0000,0.0000,0.0000,2.3000,0.0000,0.0000,0.0000,0.0000,0.0000,0.0000,16.5853,0.0635,0.0000,0.0000,0.2999,0.0127,0.0000,0.0000,0.0000,0.0000,0.0000,0.0000,720.3669,1.3808,0.0000,0.0000,0.0000,0.0000,0.0000,0.0000,0.0000,0.0000,0.0000,0.0000,2.6998,0.0554,0.0000,0.0000,16.5843,0.3406,0.0000,0.0000,2.2008,0.0477,0.0000,0.0000,13.5193,0.2933,0.0000,0.0000
2015.92,350,44.5000,784.0343,245.1799,12.9042,0.0000,0.0000,0.0000,0.0000,527.1334,1.2559,0.0000,0.0000,5.0283,0.1251,0.0000,0.0000,522.1050,1.1308,0.0000,0.0000,0.0000,0.0000,0.0000,0.0000,0.0000,0.0000,0.0000,0.0000,0.0000,2.3000,0.0000,0.0000,0.0000,0.0000,0.0000,0.0000,20.1557,0.0230,0.0000,0.0000,0.4652,0.0190,0.0000,0.0000,0.0000,0.0000,0.0000,0.0000,527.1334,1.2559,0.0000,0.0000,0.0000,0.0000,0.0000,0.0000,0.0000,0.0000,0.0000,0.0000,2.0045,0.0428,0.0000,0.0000,12.3135,0.2629,0.0000,0.0000,2.5270,0.0547,0.0000,0.0000,15.5231,0.3363,0.0000,0.0000
2016.75,296,3.1000,1059.6769,353.5905,18.6100,634.9596,15.9156,0.0000,0.0000,380.9757,4.0107,0.0000,0.0000,380.9757,4.0107,0.0000,0.0000,0.0000,0.0000,0.0000,0.0000,21.1653,0.2228,0.0000,0.0000,21.1653,0.2228,0.0000,0.0000,0.0000,20.2000,0.0000,0.0000,0.0000,0.0000,0.0000,0.0000,21.3907,0.0114,0.0000,0.0000,0.2770,0.0119,0.0000,0.0000,634.9596,15.9156,0.0000,0.0000,380.9757,0.0000,0.0000,0.0000,0.0000,0.0000,0.0000,0.0000,0.0000,0.0000,0.0000,0.0000,13.9527,0.2981,0.0000,0.0000,265.1006,5.6632,0.0000,0.0000,10.8273,0.2348,0.0000,0.0000,205.7178,4.4609,0.0000,0.0000
2017.75,285,60.2000,149.2612,49.6745,2.6144,47.2755,7.9766,0.0000,0.0000,0.0000,0.0000,0.0000,0.0000,0.0000,0.0000,0.0000,0.0000,0.0000,0.0000,0.0000,0.0000,50.7997,1.8372,0.0000,0.0000,50.7997,1.8372,0.0000,0.0000,0.0000,0.0000,0.0000,0.0000,0.0000,0.0000,0.0000,0.0000,29.3733,0.1317,0.0000,0.0000,0.5439,0.0218,0.0000,0.0000,47.2755,7.9766,0.0000,0.0000,0.0000,0.0000,0.0000,0.0000,0.0000,0.0000,0.0000,0.0000,0.0000,0.0000,0.0000,0.0000,1.6036,0.0660,0.0000,0.0000,30.4690,1.2534,0.0000,0.0000,0.4742,0.0195,0.0000,0.0000,9.0095,0.3699,0.0000,0.0000
2018.75,288,59.1000,916.3736,119.6107,6.2953,0.0910,0.0145,0.0000,0.0000,867.0948,13.2162,0.0000,0.0000,867.0948,13.2162,0.0000,0.0000,0.0000,0.0000,0.0000,0.0000,9.1273,0.1391,0.0000,0.0000,36.5093,0.5565,0.0000,0.0000,0.0000,5.6000,0.0000,0.0000,0.0000,0.0000,0.0000,0.0000,27.4155,0.2695,0.0000,0.0000,0.6007,0.0247,0.0000,0.0000,0.0910,0.0145,0.0000,0.0000,867.0948,0.0000,0.0000,0.0000,0.0000,0.0000,0.0000,0.0000,0.0000,0.0000,0.0000,0.0000,4.3085,0.0760,0.0000,0.0000,81.8617,1.4443,0.0000,0.0000,1.0317,0.0190,0.0000,0.0000,19.6031,0.3617,0.0000,0.0000
2019.75,285,60.2000,244.7287,58.1721,3.0617,80.8660,11.2168,0.0000,0.0000,0.0000,0.0000,0.0000,0.0000,0.0000,0.0000,0.0000,0.0000,0.0000,0.0000,0.0000,0.0000,81.6795,2.4140,0.0000,0.0000,81.6795,2.4140,0.0000,0.0000,0.0000,0.0000,0.0000,0.0000,0.0000,0.0000,0.0000,0.0000,48.0380,0.5415,0.0000,0.0000,0.6569,0.0266,0.0000,0.0000,80.8660,11.2168,0.0000,0.0000,0.0000,0.0000,0.0000,0.0000,0.0000,0.0000,0.0000,0.0000,0.0000,0.0000,0.0000,0.0000,2.0199,0.0834,0.0000,0.0000,38.3774,1.5846,0.0000,0.0000,0.5402,0.0223,0.0000,0.0000,10.2645,0.4229,0.0000,0.0000
2020.75,288,59.1000,822.8465,108.0961,5.6893,0.0815,0.0137,0.0000,0.0000,777.7110,12.5038,0.0000,0.0000,777.7110,12.5038,0.0000,0.0000,0.0000,0.0000,0.0000,0.0000,8.1864,0.1316,0.0000,0.0000,32.7458,0.5265,0.0000,0.0000,0.0000,5.6000,0.0000,0.0000,0.0000,0.0000,0.0000,0.0000,44.2349,0.7880,0.0000,0.0000,0.4129,0.0171,0.0000,0.0000,0.0815,0.0137,0.0000,0.0000,777.7110,0.0000,0.0000,0.0000,0.0000,0.0000,0.0000,0.0000,0.0000,0.0000,0.0000,0.0000,3.9799,0.0725,0.0000,0.0000,75.6184,1.3776,0.0000,0.0000,0.8674,0.0166,0.0000,0.0000,16.4800,0.3156,0.0000,0.0000
2021.75,285,60.2000,217.2204,55.9418,2.9443,71.5264,10.3887,0.0000,0.0000,0.0000,0.0000,0.0000,0.0000,0.0000,0.0000,0.0000,0.0000,0.0000,0.0000,0.0000,0.0000,72.6101,2.2483,0.0000,0.0000,72.6101,2.2483,0.0000,0.0000,0.0000,0.0000,0.0000,0.0000,0.0000,0.0000,0.0000,0.0000,34.9253,0.7413,0.0000,0.0000,0.3043,0.0123,0.0000,0.0000,71.5264,10.3887,0.0000,0.0000,0.0000,0.0000,0.0000,0.0000,0.0000,0.0000,0.0000,0.0000,0.0000,0.0000,0.0000,0.0000,1.9809,0.0816,0.0000,0.0000,37.6365,1.5509,0.0000,0.0000,0.4922,0.0202,0.0000,0.0000,9.3525,0.3845,0.0000,0.0000
2022.75,288,59.1000,794.8937,108.3917,5.7048,0.0791,0.0130,0.0000,0.0000,752.4363,11.8911,0.0000,0.0000,752.4363,11.8911,0.0000,0.0000,0.0000,0.0000,0.0000,0.0000,7.9204,0.1252,0.0000,0.0000,31.6815,0.5007,0.0000,0.0000,0.0000,5.6000,0.0000,0.0000,0.0000,0.0000,0.0000,0.0000,28.8579,0.6106,0.0000,0.0000,0.2913,0.0121,0.0000,0.0000,0.0791,0.0130,0.0000,0.0000,752.4363,0.0000,0.0000,0.0000,0.0000,0.0000,0.0000,0.0000,0.0000,0.0000,0.0000,0.0000,3.5472,0.0623,0.0000,0.0000,67.3961,1.1843,0.0000,0.0000,0.9492,0.0177,0.0000,0.0000,18.0347,0.3356,0.0000,0.0000
2023.75,285,60.2000,161.0856,53.0156,2.7903,49.7244,8.2624,0.0000,0.0000,0.0000,0.0000,0.0000,0.0000,0.0000,0.0000,0.0000,0.0000,0.0000,0.0000,0.0000,0.0000,55.4509,1.9804,0.0000,0.0000,55.4509,1.9804,0.0000,0.0000,0.0000,0.0000,0.0000,0.0000,0.0000,0.0000,0.0000,0.0000,26.6903,0.5213,0.0000,0.0000,0.2221,0.0090,0.0000,0.0000,49.7244,8.2624,0.0000,0.0000,0.0000,0.0000,0.0000,0.0000,0.0000,0.0000,0.0000,0.0000,0.0000,0.0000,0.0000,0.0000,1.6690,0.0685,0.0000,0.0000,31.7112,1.3022,0.0000,0.0000,0.5140,0.0211,0.0000,0.0000,9.7661,0.4003,0.0000,0.0000
2024.75,288,59.1000,769.7034,111.9341,5.8913,0.0764,0.0126,0.0000,0.0000,727.6782,11.4960,0.0000,0.0000,727.6782,11.4960,0.0000,0.0000,0.0000,0.0000,0.0000,0.0000,7.6598,0.1210,0.0000,0.0000,30.6391,0.4840,0.0000,0.0000,0.0000,5.6000,0.0000,0.0000,0.0000,0.0000,0.0000,0.0000,11.6211,0.2384,0.0000,0.0000,0.1100,0.0046,0.0000,0.0000,0.0764,0.0126,0.0000,0.0000,727.6782,0.0000,0.0000,0.0000,0.0000,0.0000,0.0000,0.0000,0.0000,0.0000,0.0000,0.0000,3.8954,0.0690,0.0000,0.0000,74.0135,1.3110,0.0000,0.0000,0.9713,0.0183,0.0000,0.0000,18.4551,0.3472,0.0000,0.0000
2025.75,285,60.2000,179.1760,54.4541,2.8660,49.2098,8.3066,0.0000,0.0000,0.0000,0.0000,0.0000,0.0000,0.0000,0.0000,0.0000,0.0000,0.0000,0.0000,0.0000,0.0000,64.6385,2.3574,0.0000,0.0000,64.6385,2.3574,0.0000,0.0000,0.0000,0.0000,0.0000,0.0000,0.0000,0.0000,0.0000,0.0000,40.4694,0.8960,0.0000,0.0000,0.3501,0.0140,0.0000,0.0000,49.2098,8.3066,0.0000,0.0000,0.0000,0.0000,0.0000,0.0000,0.0000,0.0000,0.0000,0.0000,0.0000,0.0000,0.0000,0.0000,1.7529,0.0718,0.0000,0.0000,33.3048,1.3634,0.0000,0.0000,0.5190,0.0212,0.0000,0.0000,9.8613,0.4026,0.0000,0.0000
2026.75,288,59.1000,802.4636,107.5052,5.6582,0.0795,0.0130,0.0000,0.0000,759.2704,11.8384,0.0000,0.0000,759.2704,11.8384,0.0000,0.0000,0.0000,0.0000,0.0000,0.0000,7.9923,0.1246,0.0000,0.0000,31.9693,0.4985,0.0000,0.0000,0.0000,5.6000,0.0000,0.0000,0.0000,0.0000,0.0000,0.0000,30.1816,0.5478,0.0000,0.0000,0.2108,0.0087,0.0000,0.0000,0.0795,0.0130,0.0000,0.0000,759.2704,0.0000,0.0000,0.0000,0.0000,0.0000,0.0000,0.0000,0.0000,0.0000,0.0000,0.0000,3.9926,0.0698,0.0000,0.0000,75.8591,1.3258,0.0000,0.0000,0.8442,0.0155,0.0000,0.0000,16.0399,0.2945,0.0000,0.0000
2027.75,285,60.2000,228.1644,54.9584,2.8925,75.3991,10.6061,0.0000,0.0000,0.0000,0.0000,0.0000,0.0000,0.0000,0.0000,0.0000,0.0000,0.0000,0.0000,0.0000,0.0000,76.1419,2.2820,0.0000,0.0000,76.1419,2.2820,0.0000,0.0000,0.0000,0.0000,0.0000,0.0000,0.0000,0.0000,0.0000,0.0000,28.7465,0.6827,0.0000,0.0000,0.4397,0.0176,0.0000,0.0000,75.3991,10.6061,0.0000,0.0000,0.0000,0.0000,0.0000,0.0000,0.0000,0.0000,0.0000,0.0000,0.0000,0.0000,0.0000,0.0000,1.9011,0.0778,0.0000,0.0000,36.1208,1.4789,0.0000,0.0000,0.5141,0.0210,0.0000,0.0000,9.7686,0.3988,0.0000,0.0000
2028.75,288,59.1000,830.9883,117.5749,6.1882,0.0828,0.0129,0.0000,0.0000,786.5773,11.7529,0.0000,0.0000,786.5773,11.7529,0.0000,0.0000,0.0000,0.0000,0.0000,0.0000,8.2798,0.1237,0.0000,0.0000,33.1190,0.4949,0.0000,0.0000,0.0000,5.6000,0.0000,0.0000,0.0000,0.0000,0.0000,0.0000,21.2868,0.4661,0.0000,0.0000,0.1940,0.0079,0.0000,0.0000,0.0828,0.0129,0.0000,0.0000,786.5773,0.0000,0.0000,0.0000,0.0000,0.0000,0.0000,0.0000,0.0000,0.0000,0.0000,0.0000,4.2015,0.0700,0.0000,0.0000,79.8286,1.3304,0.0000,0.0000,1.0329,0.0184,0.0000,0.0000,19.6245,0.3496,0.0000,0.0000
2029.75,285,60.2000,153.8476,50.3037,2.6476,48.0353,8.0168,0.0000,0.0000,0.0000,0.0000,0.0000,0.0000,0.0000,0.0000,0.0000,0.0000,0.0000,0.0000,0.0000,0.0000,52.6898,1.8879,0.0000,0.0000,52.6898,1.8879,0.0000,0.0000,0.0000,0.0000,0.0000,0.0000,0.0000,0.0000,0.0000,0.0000,28.3634,0.5161,0.0000,0.0000,0.2128,0.0083,0.0000,0.0000,48.0353,8.0168,0.0000,0.0000,0.0000,0.0000,0.0000,0.0000,0.0000,0.0000,0.0000,0.0000,0.0000,0.0000,0.0000,0.0000,1.5845,0.0649,0.0000,0.0000,30.1052,1.2325,0.0000,0.0000,0.4949,0.0202,0.0000,0.0000,9.4034,0.3847,0.0000,0.0000
2030.75,288,59.1000,773.7170,111.4168,5.8640,0.0768,0.0119,0.0000,0.0000,731.6909,10.8393,0.0000,0.0000,731.6909,10.8393,0.0000,0.0000,0.0000,0.0000,0.0000,0.0000,7.7020,0.1141,0.0000,0.0000,30.8081,0.4564,0.0000,0.0000,0.0000,5.6000,0.0000,0.0000,0.0000,0.0000,0.0000,0.0000,27.4087,0.4441,0.0000,0.0000,0.2905,0.0117,0.0000,0.0000,0.0768,0.0119,0.0000,0.0000,731.6909,0.0000,0.0000,0.0000,0.0000,0.0000,0.0000,0.0000,0.0000,0.0000,0.0000,0.0000,3.9697,0.0653,0.0000,0.0000,75.4248,1.2400,0.0000,0.0000,0.9806,0.0171,0.0000,0.0000,18.6308,0.3252,0.0000,0.0000
