Treatment,dSOC (gC/m2),N2O (gN2O-N/m2),dSOC (gCO2e/m2),N2O (gCO2e/m2),Total (gCO2e/m2),Total (gCO2e/m2/yr),Nleach(gNO3-N/m2/yr),Nit(gN/m2/yr)
100_measBNI_2018,119.1941,1.314577,437.045033333333,619.729157142857,1056.77419047619,1056.77419047619,1.238866,6.53025773
100_measBNI_dly3wk_2018,118.6365,1.301046,435.0005,613.350257142857,1048.35075714286,1048.35075714286,1.179831,6.46546006
100_measBNI_dly5wk_2018,118.6861,1.300127,435.182366666667,612.917014285714,1048.09938095238,1048.09938095238,1.16456,6.45770241
100_measBNI_split_2018,119.1831,1.309494,437.0047,617.332885714286,1054.33758571429,1054.33758571429,1.191509,6.49584776
