time,dayofyr,crpval,agcacc,bgcjacc,bgcmacc,cgrain,egrain(N),egrain(P),egrain(S),crmvst,ermvst(N),ermvst(P),ermvst(S),cstraw,estraw(N),estraw(P),estraw(S),stdstraw,estdstraw(N),estdstraw(P),estdstraw(S),addsdc,addsde(N),addsde(P),addsde(S),resid,reside(N),reside(P),reside(S),irrapp,fertapp(N),fertapp(P),fertapp(S),omadapp,omaeapp(N),omaeapp(P),omaeapp(S),strmac(1),strmac(2),strmac(3),strmac(4),strmac(5),strmac(6),strmac(7),strmac(8),cgracc,egracc(N),egracc(P),egracc(S),accrst,accrste(N),accrste(P),accrste(S),ctubesj,etubesj(N),etubesj(P),etubesj(S),ctubesm,etubesm(N),etubesm(P),etubesm(S),srfclittrj,srfclittrj(N),esrfclittrj(P),esrfclittrj(S),soillittrj,esoillittrj(N),esoillittrj(P),esoillittrj(S),srfclittrm,esrfclittrm(N),esrfclittrm(P),esrfclittrm(S),soillittrm,esoillittrm(N),esoillittrm(P),esoillittrm(S)
2008.75,302,3.1000,876.7198,291.0782,15.3199,518.0341,13.8467,0.0000,0.0000,321.9158,3.6028,0.0000,0.0000,321.9158,3.6028,0.0000,0.0000,0.0000,0.0000,0.0000,0.0000,17.8842,0.2002,0.0000,0.0000,17.8842,0.2002,0.0000,0.0000,0.0000,16.8000,0.0000,0.0000,0.0000,0.0000,0.0000,0.0000,37.0725,0.8032,0.0000,0.0000,0.6425,0.0295,0.0000,0.0000,518.0341,13.8467,0.0000,0.0000,321.9158,0.0000,0.0000,0.0000,0.0000,0.0000,0.0000,0.0000,0.0000,0.0000,0.0000,0.0000,10.1887,0.2197,0.0000,0.0000,193.5855,4.1738,0.0000,0.0000,2.4576,0.0538,0.0000,0.0000,46.6938,1.0230,0.0000,0.0000
2009.83,307,3.1000,823.3663,298.4262,15.7067,493.1036,13.2699,0.0000,0.0000,295.8622,3.3440,0.0000,0.0000,295.8622,3.3440,0.0000,0.0000,0.0000,0.0000,0.0000,0.0000,16.4368,0.1858,0.0000,0.0000,16.4368,0.1858,0.0000,0.0000,0.0000,20.2000,0.0000,0.0000,0.0000,0.0000,0.0000,0.0000,37.6955,1.2286,0.0000,0.0000,0.6763,0.0297,0.0000,0.0000,493.1036,13.2699,0.0000,0.0000,295.8622,0.0000,0.0000,0.0000,0.0000,0.0000,0.0000,0.0000,0.0000,0.0000,0.0000,0.0000,10.3899,0.2234,0.0000,0.0000,197.4081,4.2443,0.0000,0.0000,2.4768,0.0541,0.0000,0.0000,47.0601,1.0273,0.0000,0.0000
2010.75,285,60.2000,201.1620,60.5099,3.1847,65.9980,9.9393,0.0000,0.0000,0.0000,0.0000,0.0000,0.0000,0.0000,0.0000,0.0000,0.0000,0.0000,0.0000,0.0000,0.0000,67.2000,2.1582,0.0000,0.0000,67.2000,2.1582,0.0000,0.0000,0.0000,0.0000,0.0000,0.0000,0.0000,0.0000,0.0000,0.0000,31.5334,1.0396,0.0000,0.0000,0.7674,0.0328,0.0000,0.0000,65.9980,9.9393,0.0000,0.0000,0.0000,0.0000,0.0000,0.0000,0.0000,0.0000,0.0000,0.0000,0.0000,0.0000,0.0000,0.0000,1.9530,0.0807,0.0000,0.0000,37.1065,1.5337,0.0000,0.0000,0.5761,0.0237,0.0000,0.0000,10.9464,0.4508,0.0000,0.0000
2012.92,350,44.2000,431.0194,110.6781,5.8252,0.0000,0.0000,0.0000,0.0000,288.7208,0.9019,0.0000,0.0000,0.0595,0.0029,0.0000,0.0000,288.6613,0.8991,0.0000,0.0000,0.0000,0.0000,0.0000,0.0000,0.0000,0.0000,0.0000,0.0000,0.0000,2.3000,0.0000,0.0000,0.0000,0.0000,0.0000,0.0000,4.4586,0.1159,0.0000,0.0000,0.1690,0.0079,0.0000,0.0000,0.0000,0.0000,0.0000,0.0000,288.7208,0.9019,0.0000,0.0000,0.0000,0.0000,0.0000,0.0000,0.0000,0.0000,0.0000,0.0000,0.6800,0.0170,0.0000,0.0000,4.1773,0.1044,0.0000,0.0000,0.5087,0.0127,0.0000,0.0000,3.1251,0.0781,0.0000,0.0000
2013.92,350,44.3000,1020.7787,327.5023,17.2370,0.0000,0.0000,0.0000,0.0000,666.4733,1.3195,0.0000,0.0000,0.2021,0.0092,0.0000,0.0000,666.2712,1.3103,0.0000,0.0000,0.0000,0.0000,0.0000,0.0000,0.0000,0.0000,0.0000,0.0000,0.0000,2.3000,0.0000,0.0000,0.0000,0.0000,0.0000,0.0000,28.8420,0.3131,0.0000,0.0000,0.2503,0.0116,0.0000,0.0000,0.0000,0.0000,0.0000,0.0000,666.4733,1.3195,0.0000,0.0000,0.0000,0.0000,0.0000,0.0000,0.0000,0.0000,0.0000,0.0000,2.1685,0.0463,0.0000,0.0000,13.3207,0.2846,0.0000,0.0000,1.3853,0.0314,0.0000,0.0000,8.5094,0.1930,0.0000,0.0000
2014.92,350,44.4000,1083.1707,363.6563,19.1398,0.0000,0.0000,0.0000,0.0000,720.3669,1.3808,0.0000,0.0000,6.7904,0.1351,0.0000,0.0000,713.5766,1.2456,0.0000,0.0000,0.0000,0.0000,0.0000,0.0000,0.0000,0.0000,0.0000,0.0000,0.0000,2.3000,0.0000,0.0000,0.0000,0.0000,0.0000,0.0000,16.5853,0.0635,0.0000,0.0000,0.2999,0.0127,0.0000,0.0000,0.0000,0.0000,0.0000,0.0000,720.3669,1.3808,0.0000,0.0000,0.0000,0.0000,0.0000,0.0000,0.0000,0.0000,0.0000,0.0000,2.6998,0.0554,0.0000,0.0000,16.5843,0.3406,0.0000,0.0000,2.2008,0.0477,0.0000,0.0000,13.5193,0.2933,0.0000,0.0000
2015.92,350,44.5000,784.0343,245.1799,12.9042,0.0000,0.0000,0.0000,0.0000,527.1334,1.2559,0.0000,0.0000,5.0283,0.1251,0.0000,0.0000,522.1050,1.1308,0.0000,0.0000,0.0000,0.0000,0.0000,0.0000,0.0000,0.0000,0.0000,0.0000,0.0000,2.3000,0.0000,0.0000,0.0000,0.0000,0.0000,0.0000,20.1557,0.0230,0.0000,0.0000,0.4652,0.0190,0.0000,0.0000,0.0000,0.0000,0.0000,0.0000,527.1334,1.2559,0.0000,0.0000,0.0000,0.0000,0.0000,0.0000,0.0000,0.0000,0.0000,0.0000,2.0045,0.0428,0.0000,0.0000,12.3135,0.2629,0.0000,0.0000,2.5270,0.0547,0.0000,0.0000,15.5231,0.3363,0.0000,0.0000
2016.75,296,3.1000,1059.6769,353.5905,18.6100,634.9596,15.9156,0.0000,0.0000,380.9757,4.0107,0.0000,0.0000,380.9757,4.0107,0.0000,0.0000,0.0000,0.0000,0.0000,0.0000,21.1653,0.2228,0.0000,0.0000,21.1653,0.2228,0.0000,0.0000,0.0000,20.2000,0.0000,0.0000,0.0000,0.0000,0.0000,0.0000,21.3907,0.0114,0.0000,0.0000,0.2770,0.0119,0.0000,0.0000,634.9596,15.9156,0.0000,0.0000,380.9757,0.0000,0.0000,0.0000,0.0000,0.0000,0.0000,0.0000,0.0000,0.0000,0.0000,0.0000,13.9527,0.2981,0.0000,0.0000,265.1006,5.6632,0.0000,0.0000,10.8273,0.2348,0.0000,0.0000,205.7178,4.4609,0.0000,0.0000
2017.75,285,60.2000,149.2612,49.6745,2.6144,47.2755,7.9766,0.0000,0.0000,0.0000,0.0000,0.0000,0.0000,0.0000,0.0000,0.0000,0.0000,0.0000,0.0000,0.0000,0.0000,50.7997,1.8372,0.0000,0.0000,50.7997,1.8372,0.0000,0.0000,0.0000,0.0000,0.0000,0.0000,0.0000,0.0000,0.0000,0.0000,29.3733,0.1317,0.0000,0.0000,0.5439,0.0218,0.0000,0.0000,47.2755,7.9766,0.0000,0.0000,0.0000,0.0000,0.0000,0.0000,0.0000,0.0000,0.0000,0.0000,0.0000,0.0000,0.0000,0.0000,1.6036,0.0660,0.0000,0.0000,30.4690,1.2534,0.0000,0.0000,0.4742,0.0195,0.0000,0.0000,9.0095,0.3699,0.0000,0.0000
2018.75,288,59.1000,1015.0929,121.8389,6.4126,0.1009,0.0174,0.0000,0.0000,960.8688,15.9005,0.0000,0.0000,960.8688,15.9005,0.0000,0.0000,0.0000,0.0000,0.0000,0.0000,10.1144,0.1674,0.0000,0.0000,40.4577,0.6695,0.0000,0.0000,0.0000,11.2000,0.0000,0.0000,0.0000,0.0000,0.0000,0.0000,27.2144,0.2713,0.0000,0.0000,0.5877,0.0257,0.0000,0.0000,0.1009,0.0174,0.0000,0.0000,960.8688,0.0000,0.0000,0.0000,0.0000,0.0000,0.0000,0.0000,0.0000,0.0000,0.0000,0.0000,4.3743,0.0836,0.0000,0.0000,83.1109,1.5877,0.0000,0.0000,1.0567,0.0213,0.0000,0.0000,20.0764,0.4052,0.0000,0.0000
2019.75,285,60.2000,247.8791,58.8633,3.0981,81.9053,11.3330,0.0000,0.0000,0.0000,0.0000,0.0000,0.0000,0.0000,0.0000,0.0000,0.0000,0.0000,0.0000,0.0000,0.0000,82.7271,2.4389,0.0000,0.0000,82.7271,2.4389,0.0000,0.0000,0.0000,0.0000,0.0000,0.0000,0.0000,0.0000,0.0000,0.0000,48.0492,0.5926,0.0000,0.0000,0.6584,0.0277,0.0000,0.0000,81.9053,11.3330,0.0000,0.0000,0.0000,0.0000,0.0000,0.0000,0.0000,0.0000,0.0000,0.0000,0.0000,0.0000,0.0000,0.0000,2.0462,0.0846,0.0000,0.0000,38.8781,1.6079,0.0000,0.0000,0.5453,0.0225,0.0000,0.0000,10.3616,0.4279,0.0000,0.0000
2020.75,288,59.1000,939.9522,110.4673,5.8141,0.0931,0.0171,0.0000,0.0000,888.8956,15.6166,0.0000,0.0000,888.8956,15.6166,0.0000,0.0000,0.0000,0.0000,0.0000,0.0000,9.3568,0.1644,0.0000,0.0000,37.4272,0.6575,0.0000,0.0000,0.0000,11.2000,0.0000,0.0000,0.0000,0.0000,0.0000,0.0000,44.2206,0.9203,0.0000,0.0000,0.4118,0.0181,0.0000,0.0000,0.0931,0.0171,0.0000,0.0000,888.8956,0.0000,0.0000,0.0000,0.0000,0.0000,0.0000,0.0000,0.0000,0.0000,0.0000,0.0000,4.0715,0.0821,0.0000,0.0000,77.3578,1.5596,0.0000,0.0000,0.8840,0.0186,0.0000,0.0000,16.7960,0.3541,0.0000,0.0000
2021.75,285,60.2000,221.2022,56.7643,2.9876,72.8337,10.5424,0.0000,0.0000,0.0000,0.0000,0.0000,0.0000,0.0000,0.0000,0.0000,0.0000,0.0000,0.0000,0.0000,0.0000,73.9372,2.2816,0.0000,0.0000,73.9372,2.2816,0.0000,0.0000,0.0000,0.0000,0.0000,0.0000,0.0000,0.0000,0.0000,0.0000,35.0046,0.8742,0.0000,0.0000,0.3062,0.0132,0.0000,0.0000,72.8337,10.5424,0.0000,0.0000,0.0000,0.0000,0.0000,0.0000,0.0000,0.0000,0.0000,0.0000,0.0000,0.0000,0.0000,0.0000,2.0133,0.0831,0.0000,0.0000,38.2521,1.5796,0.0000,0.0000,0.4975,0.0205,0.0000,0.0000,9.4518,0.3895,0.0000,0.0000
2022.75,288,59.1000,931.6542,114.1846,6.0097,0.0928,0.0167,0.0000,0.0000,882.2960,15.2686,0.0000,0.0000,882.2960,15.2686,0.0000,0.0000,0.0000,0.0000,0.0000,0.0000,9.2873,0.1607,0.0000,0.0000,37.1493,0.6429,0.0000,0.0000,0.0000,11.2000,0.0000,0.0000,0.0000,0.0000,0.0000,0.0000,28.7548,0.7413,0.0000,0.0000,0.2882,0.0129,0.0000,0.0000,0.0928,0.0167,0.0000,0.0000,882.2960,0.0000,0.0000,0.0000,0.0000,0.0000,0.0000,0.0000,0.0000,0.0000,0.0000,0.0000,3.7421,0.0731,0.0000,0.0000,71.0996,1.3898,0.0000,0.0000,0.9964,0.0207,0.0000,0.0000,18.9316,0.3936,0.0000,0.0000
2023.75,285,60.2000,165.9549,54.4863,2.8677,51.1267,8.4734,0.0000,0.0000,0.0000,0.0000,0.0000,0.0000,0.0000,0.0000,0.0000,0.0000,0.0000,0.0000,0.0000,0.0000,57.1732,2.0370,0.0000,0.0000,57.1732,2.0370,0.0000,0.0000,0.0000,0.0000,0.0000,0.0000,0.0000,0.0000,0.0000,0.0000,26.7237,0.6395,0.0000,0.0000,0.2253,0.0097,0.0000,0.0000,51.1267,8.4734,0.0000,0.0000,0.0000,0.0000,0.0000,0.0000,0.0000,0.0000,0.0000,0.0000,0.0000,0.0000,0.0000,0.0000,1.7178,0.0708,0.0000,0.0000,32.6376,1.3453,0.0000,0.0000,0.5258,0.0216,0.0000,0.0000,9.9899,0.4112,0.0000,0.0000
2024.75,288,59.1000,923.3726,124.4469,6.5498,0.0917,0.0163,0.0000,0.0000,873.5461,14.8360,0.0000,0.0000,873.5461,14.8360,0.0000,0.0000,0.0000,0.0000,0.0000,0.0000,9.1952,0.1562,0.0000,0.0000,36.7809,0.6247,0.0000,0.0000,0.0000,11.2000,0.0000,0.0000,0.0000,0.0000,0.0000,0.0000,11.6422,0.2963,0.0000,0.0000,0.1120,0.0050,0.0000,0.0000,0.0917,0.0163,0.0000,0.0000,873.5461,0.0000,0.0000,0.0000,0.0000,0.0000,0.0000,0.0000,0.0000,0.0000,0.0000,0.0000,4.3464,0.0849,0.0000,0.0000,82.5807,1.6126,0.0000,0.0000,1.0708,0.0221,0.0000,0.0000,20.3459,0.4201,0.0000,0.0000
2025.75,285,60.2000,185.2825,55.7677,2.9351,50.8614,8.5413,0.0000,0.0000,0.0000,0.0000,0.0000,0.0000,0.0000,0.0000,0.0000,0.0000,0.0000,0.0000,0.0000,0.0000,66.8561,2.4257,0.0000,0.0000,66.8561,2.4257,0.0000,0.0000,0.0000,0.0000,0.0000,0.0000,0.0000,0.0000,0.0000,0.0000,40.5040,1.1244,0.0000,0.0000,0.3626,0.0154,0.0000,0.0000,50.8614,8.5413,0.0000,0.0000,0.0000,0.0000,0.0000,0.0000,0.0000,0.0000,0.0000,0.0000,0.0000,0.0000,0.0000,0.0000,1.8004,0.0740,0.0000,0.0000,34.2074,1.4053,0.0000,0.0000,0.5276,0.0216,0.0000,0.0000,10.0249,0.4109,0.0000,0.0000
2026.75,288,59.1000,948.0123,111.3765,5.8619,0.0940,0.0168,0.0000,0.0000,897.4476,15.3840,0.0000,0.0000,897.4476,15.3840,0.0000,0.0000,0.0000,0.0000,0.0000,0.0000,9.4468,0.1619,0.0000,0.0000,37.7873,0.6477,0.0000,0.0000,0.0000,11.2000,0.0000,0.0000,0.0000,0.0000,0.0000,0.0000,30.1857,0.6863,0.0000,0.0000,0.2149,0.0096,0.0000,0.0000,0.0940,0.0168,0.0000,0.0000,897.4476,0.0000,0.0000,0.0000,0.0000,0.0000,0.0000,0.0000,0.0000,0.0000,0.0000,0.0000,4.1384,0.0811,0.0000,0.0000,78.6305,1.5417,0.0000,0.0000,0.8728,0.0180,0.0000,0.0000,16.5838,0.3417,0.0000,0.0000
2027.75,285,60.2000,236.3616,56.6093,2.9794,78.1103,10.9107,0.0000,0.0000,0.0000,0.0000,0.0000,0.0000,0.0000,0.0000,0.0000,0.0000,0.0000,0.0000,0.0000,0.0000,78.8731,2.3474,0.0000,0.0000,78.8731,2.3474,0.0000,0.0000,0.0000,0.0000,0.0000,0.0000,0.0000,0.0000,0.0000,0.0000,28.7434,0.8628,0.0000,0.0000,0.4494,0.0189,0.0000,0.0000,78.1103,10.9107,0.0000,0.0000,0.0000,0.0000,0.0000,0.0000,0.0000,0.0000,0.0000,0.0000,0.0000,0.0000,0.0000,0.0000,1.9657,0.0808,0.0000,0.0000,37.3492,1.5357,0.0000,0.0000,0.5256,0.0216,0.0000,0.0000,9.9865,0.4097,0.0000,0.0000
2028.75,288,59.1000,997.8533,123.5327,6.5017,0.0995,0.0171,0.0000,0.0000,945.0115,15.5640,0.0000,0.0000,945.0115,15.5640,0.0000,0.0000,0.0000,0.0000,0.0000,0.0000,9.9475,0.1638,0.0000,0.0000,39.7900,0.6553,0.0000,0.0000,0.0000,11.2000,0.0000,0.0000,0.0000,0.0000,0.0000,0.0000,21.2358,0.5947,0.0000,0.0000,0.1973,0.0086,0.0000,0.0000,0.0995,0.0171,0.0000,0.0000,945.0115,0.0000,0.0000,0.0000,0.0000,0.0000,0.0000,0.0000,0.0000,0.0000,0.0000,0.0000,4.4196,0.0822,0.0000,0.0000,83.9720,1.5620,0.0000,0.0000,1.0821,0.0217,0.0000,0.0000,20.5602,0.4131,0.0000,0.0000
2029.75,285,60.2000,159.1707,51.8722,2.7301,49.6938,8.2610,0.0000,0.0000,0.0000,0.0000,0.0000,0.0000,0.0000,0.0000,0.0000,0.0000,0.0000,0.0000,0.0000,0.0000,54.5134,1.9456,0.0000,0.0000,54.5134,1.9456,0.0000,0.0000,0.0000,0.0000,0.0000,0.0000,0.0000,0.0000,0.0000,0.0000,28.4380,0.6670,0.0000,0.0000,0.2186,0.0090,0.0000,0.0000,49.6938,8.2610,0.0000,0.0000,0.0000,0.0000,0.0000,0.0000,0.0000,0.0000,0.0000,0.0000,0.0000,0.0000,0.0000,0.0000,1.6374,0.0673,0.0000,0.0000,31.1110,1.2790,0.0000,0.0000,0.5066,0.0208,0.0000,0.0000,9.6248,0.3956,0.0000,0.0000
2030.75,288,59.1000,924.3298,118.1417,6.2180,0.0918,0.0158,0.0000,0.0000,874.6541,14.3907,0.0000,0.0000,874.6541,14.3907,0.0000,0.0000,0.0000,0.0000,0.0000,0.0000,9.2069,0.1515,0.0000,0.0000,36.8275,0.6059,0.0000,0.0000,0.0000,11.2000,0.0000,0.0000,0.0000,0.0000,0.0000,0.0000,27.1879,0.5630,0.0000,0.0000,0.2895,0.0128,0.0000,0.0000,0.0918,0.0158,0.0000,0.0000,874.6541,0.0000,0.0000,0.0000,0.0000,0.0000,0.0000,0.0000,0.0000,0.0000,0.0000,0.0000,4.2157,0.0771,0.0000,0.0000,80.0989,1.4653,0.0000,0.0000,1.0360,0.0205,0.0000,0.0000,19.6844,0.3886,0.0000,0.0000
