Time,year,dayofyear,BNI%,maxBNI%
2018.002732,2018,1,0,0
2018.005464,2018,2,0,0
2018.008197,2018,3,0,0
2018.010929,2018,4,0,0
2018.013661,2018,5,0,0
2018.016393,2018,6,0,0
2018.019126,2018,7,0,0
2018.021858,2018,8,0,0
2018.02459,2018,9,0,0
2018.027322,2018,10,0,0
2018.030055,2018,11,0,0
2018.032787,2018,12,0,0
2018.035519,2018,13,0,0
2018.038251,2018,14,0,0
2018.040984,2018,15,0,0
2018.043716,2018,16,0,0
2018.046448,2018,17,0,0
2018.04918,2018,18,0,0
2018.051913,2018,19,0,0
2018.054645,2018,20,0,0
2018.057377,2018,21,0,0
2018.060109,2018,22,0,0
2018.062842,2018,23,0,0
2018.065574,2018,24,0,0
2018.068306,2018,25,0,0
2018.071038,2018,26,0,0
2018.07377,2018,27,0,0
2018.076503,2018,28,0,0
2018.079235,2018,29,0,0
2018.081967,2018,30,0,0
2018.084699,2018,31,0,0
2018.087432,2018,32,0,0
2018.090164,2018,33,0,0
2018.092896,2018,34,0,0
2018.095628,2018,35,0,0
2018.098361,2018,36,0,0
2018.101093,2018,37,0,0
2018.103825,2018,38,0,0
2018.106557,2018,39,0,0
2018.10929,2018,40,0,0
2018.112022,2018,41,0,0
2018.114754,2018,42,0,0
2018.117486,2018,43,0,0
2018.120219,2018,44,0,0
2018.122951,2018,45,0,0
2018.125683,2018,46,0,0
2018.128415,2018,47,0,0
2018.131148,2018,48,0,0
2018.13388,2018,49,0,0
2018.136612,2018,50,0,0
2018.139344,2018,51,0,0
2018.142077,2018,52,0,0
2018.144809,2018,53,0,0
2018.147541,2018,54,0,0
2018.150273,2018,55,0,0
2018.153005,2018,56,0,0
2018.155738,2018,57,0,0
2018.15847,2018,58,0,0
2018.161202,2018,59,0,0
2018.163934,2018,60,0,0
2018.166667,2018,61,0,0
2018.169399,2018,62,0,0
2018.172131,2018,63,0,0
2018.174863,2018,64,0,0
2018.177596,2018,65,0,0
2018.180328,2018,66,0,0
2018.18306,2018,67,0,0
2018.185792,2018,68,0,0
2018.188525,2018,69,0,0
2018.191257,2018,70,0,0
2018.193989,2018,71,0,0
2018.196721,2018,72,0,0
2018.199454,2018,73,0,0
2018.202186,2018,74,0,0
2018.204918,2018,75,0,0
2018.20765,2018,76,0,0
2018.210383,2018,77,0,0
2018.213115,2018,78,0,0
2018.215847,2018,79,0,0
2018.218579,2018,80,0,0
2018.221311,2018,81,0,0
2018.224044,2018,82,0,0
2018.226776,2018,83,0,0
2018.229508,2018,84,0,0
2018.23224,2018,85,0,0
2018.234973,2018,86,0,0
2018.237705,2018,87,0,0
2018.240437,2018,88,0,0
2018.243169,2018,89,0,0
2018.245902,2018,90,0,0
2018.248634,2018,91,0,0
2018.251366,2018,92,0,0
2018.254098,2018,93,0,0
2018.256831,2018,94,0,0
2018.259563,2018,95,0,0
2018.262295,2018,96,0,0
2018.265027,2018,97,0,0
2018.26776,2018,98,0,0
2018.270492,2018,99,0,0
2018.273224,2018,100,0,0
2018.275956,2018,101,0,0
2018.278689,2018,102,0,0
2018.281421,2018,103,0,0
2018.284153,2018,104,0,0
2018.286885,2018,105,0,0
2018.289617,2018,106,0,0
2018.29235,2018,107,0,0
2018.295082,2018,108,0,0
2018.297814,2018,109,0,0
2018.300546,2018,110,0,0
2018.303279,2018,111,0,0
2018.306011,2018,112,0,0
2018.308743,2018,113,0,0
2018.311475,2018,114,0,0
2018.314208,2018,115,0,0
2018.31694,2018,116,0,0
2018.319672,2018,117,0,0
2018.322404,2018,118,0,0
2018.325137,2018,119,0,0
2018.327869,2018,120,0,0
2018.330601,2018,121,0,0
2018.333333,2018,122,0,0
2018.336066,2018,123,0,0
2018.338798,2018,124,0,0
2018.34153,2018,125,0,0
2018.344262,2018,126,0,0
2018.346995,2018,127,0,0
2018.349727,2018,128,0,0
2018.352459,2018,129,0,0
2018.355191,2018,130,0,0
2018.357923,2018,131,0,0
2018.360656,2018,132,0,0
2018.363388,2018,133,0,0
2018.36612,2018,134,0,0
2018.368852,2018,135,0,0
2018.371585,2018,136,0,0
2018.374317,2018,137,0,0
2018.377049,2018,138,0,0
2018.379781,2018,139,0,0
2018.382514,2018,140,0,0
2018.385246,2018,141,0,0
2018.387978,2018,142,0,0
2018.39071,2018,143,0,0
2018.393443,2018,144,0,0
2018.396175,2018,145,0,0
2018.398907,2018,146,0,0
2018.401639,2018,147,0,0
2018.404372,2018,148,0,0
2018.407104,2018,149,0,0
2018.409836,2018,150,0,0
2018.412568,2018,151,0,0
2018.415301,2018,152,0,0
2018.418033,2018,153,0,0
2018.420765,2018,154,0,0
2018.423497,2018,155,0,0
2018.42623,2018,156,0,0
2018.428962,2018,157,0,0
2018.431694,2018,158,0,0
2018.434426,2018,159,0,0
2018.437158,2018,160,0,0
2018.439891,2018,161,0,0
2018.442623,2018,162,0,0
2018.445355,2018,163,0,0
2018.448087,2018,164,0,0
2018.45082,2018,165,0,0
2018.453552,2018,166,0,0
2018.456284,2018,167,0,0
2018.459016,2018,168,0,0
2018.461749,2018,169,0,0
2018.464481,2018,170,0,0
2018.467213,2018,171,0,0
2018.469945,2018,172,0,70
2018.472678,2018,173,0,70
2018.47541,2018,174,0,70
2018.478142,2018,175,0,70
2018.480874,2018,176,0,70
2018.483607,2018,177,0,70
2018.486339,2018,178,3,70
2018.489071,2018,179,3,70
2018.491803,2018,180,3,70
2018.494536,2018,181,3,70
2018.497268,2018,182,3,70
2018.5,2018,183,3,70
2018.502732,2018,184,3,70
2018.505464,2018,185,3,70
2018.508197,2018,186,3,70
2018.510929,2018,187,3,70
2018.513661,2018,188,3,70
2018.516393,2018,189,3,70
2018.519126,2018,190,3,70
2018.521858,2018,191,3,70
2018.52459,2018,192,12,70
2018.527322,2018,193,12,70
2018.530055,2018,194,12,70
2018.532787,2018,195,12,70
2018.535519,2018,196,12,70
2018.538251,2018,197,12,70
2018.540984,2018,198,12,70
2018.543716,2018,199,12,70
2018.546448,2018,200,12,70
2018.54918,2018,201,12,70
2018.551913,2018,202,12,70
2018.554645,2018,203,12,70
2018.557377,2018,204,12,70
2018.560109,2018,205,12,70
2018.562842,2018,206,20,70
2018.565574,2018,207,20,70
2018.568306,2018,208,20,70
2018.571038,2018,209,20,70
2018.57377,2018,210,20,70
2018.576503,2018,211,20,70
2018.579235,2018,212,20,70
2018.581967,2018,213,20,70
2018.584699,2018,214,20,70
2018.587432,2018,215,20,70
2018.590164,2018,216,20,70
2018.592896,2018,217,20,70
2018.595628,2018,218,20,70
2018.598361,2018,219,20,70
2018.601093,2018,220,12,70
2018.603825,2018,221,12,70
2018.606557,2018,222,12,70
2018.60929,2018,223,12,70
2018.612022,2018,224,12,70
2018.614754,2018,225,12,70
2018.617486,2018,226,12,70
2018.620219,2018,227,12,70
2018.622951,2018,228,12,70
2018.625683,2018,229,12,70
2018.628415,2018,230,12,70
2018.631148,2018,231,12,70
2018.63388,2018,232,12,70
2018.636612,2018,233,12,70
2018.639344,2018,234,5,70
2018.642077,2018,235,5,70
2018.644809,2018,236,5,70
2018.647541,2018,237,5,70
2018.650273,2018,238,5,70
2018.653005,2018,239,5,70
2018.655738,2018,240,5,70
2018.65847,2018,241,5,70
2018.661202,2018,242,5,70
2018.663934,2018,243,5,70
2018.666667,2018,244,5,70
2018.669399,2018,245,5,70
2018.672131,2018,246,5,70
2018.674863,2018,247,5,70
2018.677596,2018,248,5,70
2018.680328,2018,249,5,70
2018.68306,2018,250,5,70
2018.685792,2018,251,5,70
2018.688525,2018,252,5,70
2018.691257,2018,253,5,70
2018.693989,2018,254,5,70
2018.696721,2018,255,5,70
2018.699454,2018,256,5,70
2018.702186,2018,257,5,70
2018.704918,2018,258,5,70
2018.70765,2018,259,5,70
2018.710383,2018,260,5,70
2018.713115,2018,261,5,70
2018.715847,2018,262,0,70
2018.718579,2018,263,0,70
2018.721311,2018,264,0,70
2018.724044,2018,265,0,70
2018.726776,2018,266,0,70
2018.729508,2018,267,0,70
2018.73224,2018,268,0,70
2018.734973,2018,269,0,70
2018.737705,2018,270,0,70
2018.740437,2018,271,0,70
2018.743169,2018,272,0,70
2018.745902,2018,273,0,70
2018.748634,2018,274,0,70
2018.751366,2018,275,0,70
2018.754098,2018,276,0,70
2018.756831,2018,277,0,70
2018.759563,2018,278,0,70
2018.762295,2018,279,0,70
2018.765027,2018,280,0,70
2018.76776,2018,281,0,70
2018.770492,2018,282,0,70
2018.773224,2018,283,0,70
2018.775956,2018,284,0,70
2018.778689,2018,285,0,70
2018.781421,2018,286,0,70
2018.784153,2018,287,0,70
2018.786885,2018,288,0,70
2018.789617,2018,289,0,70
2018.79235,2018,290,0,70
2018.795082,2018,291,0,70
2018.797814,2018,292,0,70
2018.800546,2018,293,0,70
2018.803279,2018,294,0,70
2018.806011,2018,295,0,70
2018.808743,2018,296,0,70
2018.811475,2018,297,0,70
2018.814208,2018,298,0,0
2018.81694,2018,299,0,0
2018.819672,2018,300,0,0
2018.822404,2018,301,0,0
2018.825137,2018,302,0,0
2018.827869,2018,303,0,0
2018.830601,2018,304,0,0
2018.833333,2018,305,0,0
2018.836066,2018,306,0,0
2018.838798,2018,307,0,0
2018.84153,2018,308,0,0
2018.844262,2018,309,0,0
2018.846995,2018,310,0,0
2018.849727,2018,311,0,0
2018.852459,2018,312,0,0
2018.855191,2018,313,0,0
2018.857923,2018,314,0,0
2018.860656,2018,315,0,0
2018.863388,2018,316,0,0
2018.86612,2018,317,0,0
2018.868852,2018,318,0,0
2018.871585,2018,319,0,0
2018.874317,2018,320,0,0
2018.877049,2018,321,0,0
2018.879781,2018,322,0,0
2018.882514,2018,323,0,0
2018.885246,2018,324,0,0
2018.887978,2018,325,0,0
2018.89071,2018,326,0,0
2018.893443,2018,327,0,0
2018.896175,2018,328,0,0
2018.898907,2018,329,0,0
2018.901639,2018,330,0,0
2018.904372,2018,331,0,0
2018.907104,2018,332,0,0
2018.909836,2018,333,0,0
2018.912568,2018,334,0,0
2018.915301,2018,335,0,0
2018.918033,2018,336,0,0
2018.920765,2018,337,0,0
2018.923497,2018,338,0,0
2018.92623,2018,339,0,0
2018.928962,2018,340,0,0
2018.931694,2018,341,0,0
2018.934426,2018,342,0,0
2018.937158,2018,343,0,0
2018.939891,2018,344,0,0
2018.942623,2018,345,0,0
2018.945355,2018,346,0,0
2018.948087,2018,347,0,0
2018.95082,2018,348,0,0
2018.953552,2018,349,0,0
2018.956284,2018,350,0,0
2018.959016,2018,351,0,0
2018.961749,2018,352,0,0
2018.964481,2018,353,0,0
2018.967213,2018,354,0,0
2018.969945,2018,355,0,0
2018.972678,2018,356,0,0
2018.97541,2018,357,0,0
2018.978142,2018,358,0,0
2018.980874,2018,359,0,0
2018.983607,2018,360,0,0
2018.986339,2018,361,0,0
2018.989071,2018,362,0,0
2018.991803,2018,363,0,0
2018.994536,2018,364,0,0
2018.997268,2018,365,0,0
2019.002732,2019,1,0,0
2019.005464,2019,2,0,0
2019.008197,2019,3,0,0
2019.010929,2019,4,0,0
2019.013661,2019,5,0,0
2019.016393,2019,6,0,0
2019.019126,2019,7,0,0
2019.021858,2019,8,0,0
2019.02459,2019,9,0,0
2019.027322,2019,10,0,0
2019.030055,2019,11,0,0
2019.032787,2019,12,0,0
2019.035519,2019,13,0,0
2019.038251,2019,14,0,0
2019.040984,2019,15,0,0
2019.043716,2019,16,0,0
2019.046448,2019,17,0,0
2019.04918,2019,18,0,0
2019.051913,2019,19,0,0
2019.054645,2019,20,0,0
2019.057377,2019,21,0,0
2019.060109,2019,22,0,0
2019.062842,2019,23,0,0
2019.065574,2019,24,0,0
2019.068306,2019,25,0,0
2019.071038,2019,26,0,0
2019.07377,2019,27,0,0
2019.076503,2019,28,0,0
2019.079235,2019,29,0,0
2019.081967,2019,30,0,0
2019.084699,2019,31,0,0
2019.087432,2019,32,0,0
2019.090164,2019,33,0,0
2019.092896,2019,34,0,0
2019.095628,2019,35,0,0
2019.098361,2019,36,0,0
2019.101093,2019,37,0,0
2019.103825,2019,38,0,0
2019.106557,2019,39,0,0
2019.10929,2019,40,0,0
2019.112022,2019,41,0,0
2019.114754,2019,42,0,0
2019.117486,2019,43,0,0
2019.120219,2019,44,0,0
2019.122951,2019,45,0,0
2019.125683,2019,46,0,0
2019.128415,2019,47,0,0
2019.131148,2019,48,0,0
2019.13388,2019,49,0,0
2019.136612,2019,50,0,0
2019.139344,2019,51,0,0
2019.142077,2019,52,0,0
2019.144809,2019,53,0,0
2019.147541,2019,54,0,0
2019.150273,2019,55,0,0
2019.153005,2019,56,0,0
2019.155738,2019,57,0,0
2019.15847,2019,58,0,0
2019.161202,2019,59,0,0
2019.163934,2019,60,0,0
2019.166667,2019,61,0,0
2019.169399,2019,62,0,0
2019.172131,2019,63,0,0
2019.174863,2019,64,0,0
2019.177596,2019,65,0,0
2019.180328,2019,66,0,0
2019.18306,2019,67,0,0
2019.185792,2019,68,0,0
2019.188525,2019,69,0,0
2019.191257,2019,70,0,0
2019.193989,2019,71,0,0
2019.196721,2019,72,0,0
2019.199454,2019,73,0,0
2019.202186,2019,74,0,0
2019.204918,2019,75,0,0
2019.20765,2019,76,0,0
2019.210383,2019,77,0,0
2019.213115,2019,78,0,0
2019.215847,2019,79,0,0
2019.218579,2019,80,0,0
2019.221311,2019,81,0,0
2019.224044,2019,82,0,0
2019.226776,2019,83,0,0
2019.229508,2019,84,0,0
2019.23224,2019,85,0,0
2019.234973,2019,86,0,0
2019.237705,2019,87,0,0
2019.240437,2019,88,0,0
2019.243169,2019,89,0,0
2019.245902,2019,90,0,0
2019.248634,2019,91,0,0
2019.251366,2019,92,0,0
2019.254098,2019,93,0,0
2019.256831,2019,94,0,0
2019.259563,2019,95,0,0
2019.262295,2019,96,0,0
2019.265027,2019,97,0,0
2019.26776,2019,98,0,0
2019.270492,2019,99,0,0
2019.273224,2019,100,0,0
2019.275956,2019,101,0,0
2019.278689,2019,102,0,0
2019.281421,2019,103,0,0
2019.284153,2019,104,0,0
2019.286885,2019,105,0,0
2019.289617,2019,106,0,0
2019.29235,2019,107,0,0
2019.295082,2019,108,0,0
2019.297814,2019,109,0,0
2019.300546,2019,110,0,0
2019.303279,2019,111,0,0
2019.306011,2019,112,0,0
2019.308743,2019,113,0,0
2019.311475,2019,114,0,0
2019.314208,2019,115,0,0
2019.31694,2019,116,0,0
2019.319672,2019,117,0,0
2019.322404,2019,118,0,0
2019.325137,2019,119,0,0
2019.327869,2019,120,0,0
2019.330601,2019,121,0,0
2019.333333,2019,122,0,0
2019.336066,2019,123,0,0
2019.338798,2019,124,0,0
2019.34153,2019,125,0,0
2019.344262,2019,126,0,0
2019.346995,2019,127,0,0
2019.349727,2019,128,0,0
2019.352459,2019,129,0,0
2019.355191,2019,130,0,0
2019.357923,2019,131,0,0
2019.360656,2019,132,0,0
2019.363388,2019,133,0,0
2019.36612,2019,134,0,0
2019.368852,2019,135,0,0
2019.371585,2019,136,0,0
2019.374317,2019,137,0,0
2019.377049,2019,138,0,0
2019.379781,2019,139,0,0
2019.382514,2019,140,0,0
2019.385246,2019,141,0,0
2019.387978,2019,142,0,0
2019.39071,2019,143,0,0
2019.393443,2019,144,0,0
2019.396175,2019,145,0,0
2019.398907,2019,146,0,0
2019.401639,2019,147,0,0
2019.404372,2019,148,0,0
2019.407104,2019,149,0,0
2019.409836,2019,150,0,0
2019.412568,2019,151,0,0
2019.415301,2019,152,0,0
2019.418033,2019,153,0,0
2019.420765,2019,154,0,0
2019.423497,2019,155,0,0
2019.42623,2019,156,0,0
2019.428962,2019,157,0,0
2019.431694,2019,158,0,0
2019.434426,2019,159,0,0
2019.437158,2019,160,0,0
2019.439891,2019,161,0,0
2019.442623,2019,162,0,0
2019.445355,2019,163,0,0
2019.448087,2019,164,0,0
2019.45082,2019,165,0,0
2019.453552,2019,166,0,0
2019.456284,2019,167,0,0
2019.459016,2019,168,0,0
2019.461749,2019,169,0,0
2019.464481,2019,170,0,0
2019.467213,2019,171,0,0
2019.469945,2019,172,0,0
2019.472678,2019,173,0,0
2019.47541,2019,174,0,0
2019.478142,2019,175,0,0
2019.480874,2019,176,0,0
2019.483607,2019,177,0,0
2019.486339,2019,178,0,0
2019.489071,2019,179,0,0
2019.491803,2019,180,0,0
2019.494536,2019,181,0,0
2019.497268,2019,182,0,0
2019.5,2019,183,0,0
2019.502732,2019,184,0,0
2019.505464,2019,185,0,0
2019.508197,2019,186,0,0
2019.510929,2019,187,0,0
2019.513661,2019,188,0,70
2019.516393,2019,189,14,70
2019.519126,2019,190,14,70
2019.521858,2019,191,14,70
2019.52459,2019,192,14,70
2019.527322,2019,193,14,70
2019.530055,2019,194,14,70
2019.532787,2019,195,14,70
2019.535519,2019,196,14,70
2019.538251,2019,197,14,70
2019.540984,2019,198,14,70
2019.543716,2019,199,14,70
2019.546448,2019,200,14,70
2019.54918,2019,201,14,70
2019.551913,2019,202,14,70
2019.554645,2019,203,36,70
2019.557377,2019,204,36,70
2019.560109,2019,205,36,70
2019.562842,2019,206,36,70
2019.565574,2019,207,36,70
2019.568306,2019,208,36,70
2019.571038,2019,209,36,70
2019.57377,2019,210,36,70
2019.576503,2019,211,36,70
2019.579235,2019,212,36,70
2019.581967,2019,213,36,70
2019.584699,2019,214,36,70
2019.587432,2019,215,36,70
2019.590164,2019,216,36,70
2019.592896,2019,217,36,70
2019.595628,2019,218,58,70
2019.598361,2019,219,58,70
2019.601093,2019,220,58,70
2019.603825,2019,221,58,70
2019.606557,2019,222,58,70
2019.60929,2019,223,58,70
2019.612022,2019,224,58,70
2019.614754,2019,225,58,70
2019.617486,2019,226,58,70
2019.620219,2019,227,58,70
2019.622951,2019,228,58,70
2019.625683,2019,229,58,70
2019.628415,2019,230,58,70
2019.631148,2019,231,58,70
2019.63388,2019,232,40,70
2019.636612,2019,233,40,70
2019.639344,2019,234,40,70
2019.642077,2019,235,40,70
2019.644809,2019,236,40,70
2019.647541,2019,237,40,70
2019.650273,2019,238,40,70
2019.653005,2019,239,40,70
2019.655738,2019,240,40,70
2019.65847,2019,241,40,70
2019.661202,2019,242,40,70
2019.663934,2019,243,40,70
2019.666667,2019,244,40,70
2019.669399,2019,245,40,70
2019.672131,2019,246,22,70
2019.674863,2019,247,22,70
2019.677596,2019,248,22,70
2019.680328,2019,249,22,70
2019.68306,2019,250,22,70
2019.685792,2019,251,22,70
2019.688525,2019,252,22,70
2019.691257,2019,253,22,70
2019.693989,2019,254,22,70
2019.696721,2019,255,22,70
2019.699454,2019,256,22,70
2019.702186,2019,257,22,70
2019.704918,2019,258,22,70
2019.70765,2019,259,22,70
2019.710383,2019,260,22,70
2019.713115,2019,261,22,70
2019.715847,2019,262,22,70
2019.718579,2019,263,22,70
2019.721311,2019,264,22,70
2019.724044,2019,265,22,70
2019.726776,2019,266,22,70
2019.729508,2019,267,22,70
2019.73224,2019,268,22,70
2019.734973,2019,269,22,70
2019.737705,2019,270,22,70
2019.740437,2019,271,22,70
2019.743169,2019,272,22,70
2019.745902,2019,273,0,70
2019.748634,2019,274,0,70
2019.751366,2019,275,0,70
2019.754098,2019,276,0,70
2019.756831,2019,277,0,70
2019.759563,2019,278,0,70
2019.762295,2019,279,0,70
2019.765027,2019,280,0,70
2019.76776,2019,281,0,70
2019.770492,2019,282,0,70
2019.773224,2019,283,0,70
2019.775956,2019,284,0,70
2019.778689,2019,285,0,70
2019.781421,2019,286,0,70
2019.784153,2019,287,0,70
2019.786885,2019,288,0,70
2019.789617,2019,289,0,70
2019.79235,2019,290,0,70
2019.795082,2019,291,0,70
2019.797814,2019,292,0,70
2019.800546,2019,293,0,70
2019.803279,2019,294,0,70
2019.806011,2019,295,0,70
2019.808743,2019,296,0,70
2019.811475,2019,297,0,70
2019.814208,2019,298,0,70
2019.81694,2019,299,0,70
2019.819672,2019,300,0,70
2019.822404,2019,301,0,70
2019.825137,2019,302,0,70
2019.827869,2019,303,0,70
2019.830601,2019,304,0,70
2019.833333,2019,305,0,70
2019.836066,2019,306,0,70
2019.838798,2019,307,0,70
2019.84153,2019,308,0,70
2019.844262,2019,309,0,70
2019.846995,2019,310,0,70
2019.849727,2019,311,0,70
2019.852459,2019,312,0,70
2019.855191,2019,313,0,70
2019.857923,2019,314,0,0
2019.860656,2019,315,0,0
2019.863388,2019,316,0,0
2019.86612,2019,317,0,0
2019.868852,2019,318,0,0
2019.871585,2019,319,0,0
2019.874317,2019,320,0,0
2019.877049,2019,321,0,0
2019.879781,2019,322,0,0
2019.882514,2019,323,0,0
2019.885246,2019,324,0,0
2019.887978,2019,325,0,0
2019.89071,2019,326,0,0
2019.893443,2019,327,0,0
2019.896175,2019,328,0,0
2019.898907,2019,329,0,0
2019.901639,2019,330,0,0
2019.904372,2019,331,0,0
2019.907104,2019,332,0,0
2019.909836,2019,333,0,0
2019.912568,2019,334,0,0
2019.915301,2019,335,0,0
2019.918033,2019,336,0,0
2019.920765,2019,337,0,0
2019.923497,2019,338,0,0
2019.92623,2019,339,0,0
2019.928962,2019,340,0,0
2019.931694,2019,341,0,0
2019.934426,2019,342,0,0
2019.937158,2019,343,0,0
2019.939891,2019,344,0,0
2019.942623,2019,345,0,0
2019.945355,2019,346,0,0
2019.948087,2019,347,0,0
2019.95082,2019,348,0,0
2019.953552,2019,349,0,0
2019.956284,2019,350,0,0
2019.959016,2019,351,0,0
2019.961749,2019,352,0,0
2019.964481,2019,353,0,0
2019.967213,2019,354,0,0
2019.969945,2019,355,0,0
2019.972678,2019,356,0,0
2019.97541,2019,357,0,0
2019.978142,2019,358,0,0
2019.980874,2019,359,0,0
2019.983607,2019,360,0,0
2019.986339,2019,361,0,0
2019.989071,2019,362,0,0
2019.991803,2019,363,0,0
2019.994536,2019,364,0,0
2019.997268,2019,365,0,0
