time,dayofyr,crpval,agcacc,bgcjacc,bgcmacc,cgrain,egrain(N),egrain(P),egrain(S),crmvst,ermvst(N),ermvst(P),ermvst(S),cstraw,estraw(N),estraw(P),estraw(S),stdstraw,estdstraw(N),estdstraw(P),estdstraw(S),addsdc,addsde(N),addsde(P),addsde(S),resid,reside(N),reside(P),reside(S),irrapp,fertapp(N),fertapp(P),fertapp(S),omadapp,omaeapp(N),omaeapp(P),omaeapp(S),strmac(1),strmac(2),strmac(3),strmac(4),strmac(5),strmac(6),strmac(7),strmac(8),cgracc,egracc(N),egracc(P),egracc(S),accrst,accrste(N),accrste(P),accrste(S),ctubesj,etubesj(N),etubesj(P),etubesj(S),ctubesm,etubesm(N),etubesm(P),etubesm(S),srfclittrj,srfclittrj(N),esrfclittrj(P),esrfclittrj(S),soillittrj,esoillittrj(N),esoillittrj(P),esoillittrj(S),srfclittrm,esrfclittrm(N),esrfclittrm(P),esrfclittrm(S),soillittrm,esoillittrm(N),esoillittrm(P),esoillittrm(S)
2008.75,302,3.1000,876.7198,291.0782,15.3199,518.0341,13.8467,0.0000,0.0000,321.9158,3.6028,0.0000,0.0000,321.9158,3.6028,0.0000,0.0000,0.0000,0.0000,0.0000,0.0000,17.8842,0.2002,0.0000,0.0000,17.8842,0.2002,0.0000,0.0000,0.0000,16.8000,0.0000,0.0000,0.0000,0.0000,0.0000,0.0000,37.0725,0.8032,0.0000,0.0000,0.6425,0.0295,0.0000,0.0000,518.0341,13.8467,0.0000,0.0000,321.9158,0.0000,0.0000,0.0000,0.0000,0.0000,0.0000,0.0000,0.0000,0.0000,0.0000,0.0000,10.1887,0.2197,0.0000,0.0000,193.5855,4.1738,0.0000,0.0000,2.4576,0.0538,0.0000,0.0000,46.6938,1.0230,0.0000,0.0000
2009.83,307,3.1000,823.3663,298.4262,15.7067,493.1036,13.2699,0.0000,0.0000,295.8622,3.3440,0.0000,0.0000,295.8622,3.3440,0.0000,0.0000,0.0000,0.0000,0.0000,0.0000,16.4368,0.1858,0.0000,0.0000,16.4368,0.1858,0.0000,0.0000,0.0000,20.2000,0.0000,0.0000,0.0000,0.0000,0.0000,0.0000,37.6955,1.2286,0.0000,0.0000,0.6763,0.0297,0.0000,0.0000,493.1036,13.2699,0.0000,0.0000,295.8622,0.0000,0.0000,0.0000,0.0000,0.0000,0.0000,0.0000,0.0000,0.0000,0.0000,0.0000,10.3899,0.2234,0.0000,0.0000,197.4081,4.2443,0.0000,0.0000,2.4768,0.0541,0.0000,0.0000,47.0601,1.0273,0.0000,0.0000
2010.75,285,60.2000,201.1620,60.5099,3.1847,65.9980,9.9393,0.0000,0.0000,0.0000,0.0000,0.0000,0.0000,0.0000,0.0000,0.0000,0.0000,0.0000,0.0000,0.0000,0.0000,67.2000,2.1582,0.0000,0.0000,67.2000,2.1582,0.0000,0.0000,0.0000,0.0000,0.0000,0.0000,0.0000,0.0000,0.0000,0.0000,31.5334,1.0396,0.0000,0.0000,0.7674,0.0328,0.0000,0.0000,65.9980,9.9393,0.0000,0.0000,0.0000,0.0000,0.0000,0.0000,0.0000,0.0000,0.0000,0.0000,0.0000,0.0000,0.0000,0.0000,1.9530,0.0807,0.0000,0.0000,37.1065,1.5337,0.0000,0.0000,0.5761,0.0237,0.0000,0.0000,10.9464,0.4508,0.0000,0.0000
2012.92,350,44.2000,431.0194,110.6781,5.8252,0.0000,0.0000,0.0000,0.0000,288.7208,0.9019,0.0000,0.0000,0.0595,0.0029,0.0000,0.0000,288.6613,0.8991,0.0000,0.0000,0.0000,0.0000,0.0000,0.0000,0.0000,0.0000,0.0000,0.0000,0.0000,2.3000,0.0000,0.0000,0.0000,0.0000,0.0000,0.0000,4.4586,0.1159,0.0000,0.0000,0.1690,0.0079,0.0000,0.0000,0.0000,0.0000,0.0000,0.0000,288.7208,0.9019,0.0000,0.0000,0.0000,0.0000,0.0000,0.0000,0.0000,0.0000,0.0000,0.0000,0.6800,0.0170,0.0000,0.0000,4.1773,0.1044,0.0000,0.0000,0.5087,0.0127,0.0000,0.0000,3.1251,0.0781,0.0000,0.0000
2013.92,350,44.3000,1020.7787,327.5023,17.2370,0.0000,0.0000,0.0000,0.0000,666.4733,1.3195,0.0000,0.0000,0.2021,0.0092,0.0000,0.0000,666.2712,1.3103,0.0000,0.0000,0.0000,0.0000,0.0000,0.0000,0.0000,0.0000,0.0000,0.0000,0.0000,2.3000,0.0000,0.0000,0.0000,0.0000,0.0000,0.0000,28.8420,0.3131,0.0000,0.0000,0.2503,0.0116,0.0000,0.0000,0.0000,0.0000,0.0000,0.0000,666.4733,1.3195,0.0000,0.0000,0.0000,0.0000,0.0000,0.0000,0.0000,0.0000,0.0000,0.0000,2.1685,0.0463,0.0000,0.0000,13.3207,0.2846,0.0000,0.0000,1.3853,0.0314,0.0000,0.0000,8.5094,0.1930,0.0000,0.0000
2014.92,350,44.4000,1083.1707,363.6563,19.1398,0.0000,0.0000,0.0000,0.0000,720.3669,1.3808,0.0000,0.0000,6.7904,0.1351,0.0000,0.0000,713.5766,1.2456,0.0000,0.0000,0.0000,0.0000,0.0000,0.0000,0.0000,0.0000,0.0000,0.0000,0.0000,2.3000,0.0000,0.0000,0.0000,0.0000,0.0000,0.0000,16.5853,0.0635,0.0000,0.0000,0.2999,0.0127,0.0000,0.0000,0.0000,0.0000,0.0000,0.0000,720.3669,1.3808,0.0000,0.0000,0.0000,0.0000,0.0000,0.0000,0.0000,0.0000,0.0000,0.0000,2.6998,0.0554,0.0000,0.0000,16.5843,0.3406,0.0000,0.0000,2.2008,0.0477,0.0000,0.0000,13.5193,0.2933,0.0000,0.0000
2015.92,350,44.5000,784.0343,245.1799,12.9042,0.0000,0.0000,0.0000,0.0000,527.1334,1.2559,0.0000,0.0000,5.0283,0.1251,0.0000,0.0000,522.1050,1.1308,0.0000,0.0000,0.0000,0.0000,0.0000,0.0000,0.0000,0.0000,0.0000,0.0000,0.0000,2.3000,0.0000,0.0000,0.0000,0.0000,0.0000,0.0000,20.1557,0.0230,0.0000,0.0000,0.4652,0.0190,0.0000,0.0000,0.0000,0.0000,0.0000,0.0000,527.1334,1.2559,0.0000,0.0000,0.0000,0.0000,0.0000,0.0000,0.0000,0.0000,0.0000,0.0000,2.0045,0.0428,0.0000,0.0000,12.3135,0.2629,0.0000,0.0000,2.5270,0.0547,0.0000,0.0000,15.5231,0.3363,0.0000,0.0000
2016.75,296,3.1000,1059.6769,353.5905,18.6100,634.9596,15.9156,0.0000,0.0000,380.9757,4.0107,0.0000,0.0000,380.9757,4.0107,0.0000,0.0000,0.0000,0.0000,0.0000,0.0000,21.1653,0.2228,0.0000,0.0000,21.1653,0.2228,0.0000,0.0000,0.0000,20.2000,0.0000,0.0000,0.0000,0.0000,0.0000,0.0000,21.3907,0.0114,0.0000,0.0000,0.2770,0.0119,0.0000,0.0000,634.9596,15.9156,0.0000,0.0000,380.9757,0.0000,0.0000,0.0000,0.0000,0.0000,0.0000,0.0000,0.0000,0.0000,0.0000,0.0000,13.9527,0.2981,0.0000,0.0000,265.1006,5.6632,0.0000,0.0000,10.8273,0.2348,0.0000,0.0000,205.7178,4.4609,0.0000,0.0000
2017.75,285,60.2000,149.2612,49.6745,2.6144,47.2755,7.9766,0.0000,0.0000,0.0000,0.0000,0.0000,0.0000,0.0000,0.0000,0.0000,0.0000,0.0000,0.0000,0.0000,0.0000,50.7997,1.8372,0.0000,0.0000,50.7997,1.8372,0.0000,0.0000,0.0000,0.0000,0.0000,0.0000,0.0000,0.0000,0.0000,0.0000,29.3733,0.1317,0.0000,0.0000,0.5439,0.0218,0.0000,0.0000,47.2755,7.9766,0.0000,0.0000,0.0000,0.0000,0.0000,0.0000,0.0000,0.0000,0.0000,0.0000,0.0000,0.0000,0.0000,0.0000,1.6036,0.0660,0.0000,0.0000,30.4690,1.2534,0.0000,0.0000,0.4742,0.0195,0.0000,0.0000,9.0095,0.3699,0.0000,0.0000
2018.75,288,59.1000,1066.1724,120.7274,6.3541,0.1060,0.0182,0.0000,0.0000,1009.3896,16.6334,0.0000,0.0000,1009.3896,16.6334,0.0000,0.0000,0.0000,0.0000,0.0000,0.0000,10.6252,0.1751,0.0000,0.0000,42.5006,0.7004,0.0000,0.0000,0.0000,11.2000,0.0000,0.0000,0.0000,0.0000,0.0000,0.0000,27.4157,0.2695,0.0000,0.0000,0.6008,0.0248,0.0000,0.0000,0.1060,0.0182,0.0000,0.0000,1009.3896,0.0000,0.0000,0.0000,0.0000,0.0000,0.0000,0.0000,0.0000,0.0000,0.0000,0.0000,4.3556,0.0865,0.0000,0.0000,82.7562,1.6432,0.0000,0.0000,1.0384,0.0205,0.0000,0.0000,19.7305,0.3904,0.0000,0.0000
2019.75,285,60.2000,247.3275,58.7397,3.0916,81.7230,11.3128,0.0000,0.0000,0.0000,0.0000,0.0000,0.0000,0.0000,0.0000,0.0000,0.0000,0.0000,0.0000,0.0000,0.0000,82.5434,2.4346,0.0000,0.0000,82.5434,2.4346,0.0000,0.0000,0.0000,0.0000,0.0000,0.0000,0.0000,0.0000,0.0000,0.0000,48.0862,0.5613,0.0000,0.0000,0.6568,0.0273,0.0000,0.0000,81.7230,11.3128,0.0000,0.0000,0.0000,0.0000,0.0000,0.0000,0.0000,0.0000,0.0000,0.0000,0.0000,0.0000,0.0000,0.0000,2.0422,0.0844,0.0000,0.0000,38.8022,1.6043,0.0000,0.0000,0.5441,0.0225,0.0000,0.0000,10.3373,0.4267,0.0000,0.0000
2020.75,288,59.1000,991.8409,115.5287,6.0805,0.0983,0.0175,0.0000,0.0000,938.1982,15.9948,0.0000,0.0000,938.1982,15.9948,0.0000,0.0000,0.0000,0.0000,0.0000,0.0000,9.8758,0.1684,0.0000,0.0000,39.5031,0.6735,0.0000,0.0000,0.0000,11.2000,0.0000,0.0000,0.0000,0.0000,0.0000,0.0000,44.2660,0.8661,0.0000,0.0000,0.4138,0.0174,0.0000,0.0000,0.0983,0.0175,0.0000,0.0000,938.1982,0.0000,0.0000,0.0000,0.0000,0.0000,0.0000,0.0000,0.0000,0.0000,0.0000,0.0000,4.3057,0.0881,0.0000,0.0000,81.8077,1.6737,0.0000,0.0000,0.9042,0.0182,0.0000,0.0000,17.1798,0.3450,0.0000,0.0000
2021.75,285,60.2000,219.9243,56.4900,2.9732,72.4140,10.4935,0.0000,0.0000,0.0000,0.0000,0.0000,0.0000,0.0000,0.0000,0.0000,0.0000,0.0000,0.0000,0.0000,0.0000,73.5112,2.2710,0.0000,0.0000,73.5112,2.2710,0.0000,0.0000,0.0000,0.0000,0.0000,0.0000,0.0000,0.0000,0.0000,0.0000,35.0703,0.8259,0.0000,0.0000,0.3092,0.0130,0.0000,0.0000,72.4140,10.4935,0.0000,0.0000,0.0000,0.0000,0.0000,0.0000,0.0000,0.0000,0.0000,0.0000,0.0000,0.0000,0.0000,0.0000,2.0036,0.0827,0.0000,0.0000,38.0690,1.5710,0.0000,0.0000,0.4951,0.0204,0.0000,0.0000,9.4067,0.3874,0.0000,0.0000
2022.75,288,59.1000,984.8101,120.9162,6.3640,0.0981,0.0172,0.0000,0.0000,932.8046,15.6525,0.0000,0.0000,932.8046,15.6525,0.0000,0.0000,0.0000,0.0000,0.0000,0.0000,9.8190,0.1648,0.0000,0.0000,39.2760,0.6591,0.0000,0.0000,0.0000,11.2000,0.0000,0.0000,0.0000,0.0000,0.0000,0.0000,28.8691,0.6999,0.0000,0.0000,0.2942,0.0123,0.0000,0.0000,0.0981,0.0172,0.0000,0.0000,932.8046,0.0000,0.0000,0.0000,0.0000,0.0000,0.0000,0.0000,0.0000,0.0000,0.0000,0.0000,4.0193,0.0806,0.0000,0.0000,76.3662,1.5318,0.0000,0.0000,1.0291,0.0206,0.0000,0.0000,19.5531,0.3906,0.0000,0.0000
2023.75,285,60.2000,164.3641,53.9857,2.8414,50.6700,8.4034,0.0000,0.0000,0.0000,0.0000,0.0000,0.0000,0.0000,0.0000,0.0000,0.0000,0.0000,0.0000,0.0000,0.0000,56.6105,2.0182,0.0000,0.0000,56.6105,2.0182,0.0000,0.0000,0.0000,0.0000,0.0000,0.0000,0.0000,0.0000,0.0000,0.0000,26.7456,0.5941,0.0000,0.0000,0.2291,0.0096,0.0000,0.0000,50.6700,8.4034,0.0000,0.0000,0.0000,0.0000,0.0000,0.0000,0.0000,0.0000,0.0000,0.0000,0.0000,0.0000,0.0000,0.0000,1.7022,0.0701,0.0000,0.0000,32.3424,1.3314,0.0000,0.0000,0.5211,0.0214,0.0000,0.0000,9.9017,0.4070,0.0000,0.0000
2024.75,288,59.1000,974.8495,122.6651,6.4561,0.0969,0.0171,0.0000,0.0000,922.4740,15.6124,0.0000,0.0000,922.4740,15.6124,0.0000,0.0000,0.0000,0.0000,0.0000,0.0000,9.7103,0.1643,0.0000,0.0000,38.8410,0.6574,0.0000,0.0000,0.0000,11.2000,0.0000,0.0000,0.0000,0.0000,0.0000,0.0000,11.6354,0.2696,0.0000,0.0000,0.1126,0.0048,0.0000,0.0000,0.0969,0.0171,0.0000,0.0000,922.4740,0.0000,0.0000,0.0000,0.0000,0.0000,0.0000,0.0000,0.0000,0.0000,0.0000,0.0000,4.3196,0.0881,0.0000,0.0000,82.0719,1.6744,0.0000,0.0000,1.0428,0.0208,0.0000,0.0000,19.8131,0.3949,0.0000,0.0000
2025.75,285,60.2000,183.6654,55.4092,2.9163,50.4244,8.4791,0.0000,0.0000,0.0000,0.0000,0.0000,0.0000,0.0000,0.0000,0.0000,0.0000,0.0000,0.0000,0.0000,0.0000,66.2690,2.4076,0.0000,0.0000,66.2690,2.4076,0.0000,0.0000,0.0000,0.0000,0.0000,0.0000,0.0000,0.0000,0.0000,0.0000,40.5240,1.0212,0.0000,0.0000,0.3620,0.0149,0.0000,0.0000,50.4244,8.4791,0.0000,0.0000,0.0000,0.0000,0.0000,0.0000,0.0000,0.0000,0.0000,0.0000,0.0000,0.0000,0.0000,0.0000,1.7884,0.0734,0.0000,0.0000,33.9798,1.3947,0.0000,0.0000,0.5247,0.0215,0.0000,0.0000,9.9701,0.4083,0.0000,0.0000
2026.75,288,59.1000,987.0833,111.7533,5.8818,0.0979,0.0173,0.0000,0.0000,934.5848,15.7836,0.0000,0.0000,934.5848,15.7836,0.0000,0.0000,0.0000,0.0000,0.0000,0.0000,9.8377,0.1661,0.0000,0.0000,39.3509,0.6646,0.0000,0.0000,0.0000,11.2000,0.0000,0.0000,0.0000,0.0000,0.0000,0.0000,30.2544,0.6260,0.0000,0.0000,0.2166,0.0090,0.0000,0.0000,0.0979,0.0173,0.0000,0.0000,934.5848,0.0000,0.0000,0.0000,0.0000,0.0000,0.0000,0.0000,0.0000,0.0000,0.0000,0.0000,4.1714,0.0844,0.0000,0.0000,79.2557,1.6028,0.0000,0.0000,0.8684,0.0173,0.0000,0.0000,16.5005,0.3279,0.0000,0.0000
2027.75,285,60.2000,234.5064,56.2153,2.9587,77.4965,10.8417,0.0000,0.0000,0.0000,0.0000,0.0000,0.0000,0.0000,0.0000,0.0000,0.0000,0.0000,0.0000,0.0000,0.0000,78.2547,2.3326,0.0000,0.0000,78.2547,2.3326,0.0000,0.0000,0.0000,0.0000,0.0000,0.0000,0.0000,0.0000,0.0000,0.0000,28.7605,0.7841,0.0000,0.0000,0.4499,0.0185,0.0000,0.0000,77.4965,10.8417,0.0000,0.0000,0.0000,0.0000,0.0000,0.0000,0.0000,0.0000,0.0000,0.0000,0.0000,0.0000,0.0000,0.0000,1.9513,0.0802,0.0000,0.0000,37.0756,1.5230,0.0000,0.0000,0.5224,0.0214,0.0000,0.0000,9.9248,0.4068,0.0000,0.0000
2028.75,288,59.1000,1037.9358,121.3730,6.3881,0.1035,0.0173,0.0000,0.0000,983.1039,15.7516,0.0000,0.0000,983.1039,15.7516,0.0000,0.0000,0.0000,0.0000,0.0000,0.0000,10.3485,0.1658,0.0000,0.0000,41.3938,0.6632,0.0000,0.0000,0.0000,11.2000,0.0000,0.0000,0.0000,0.0000,0.0000,0.0000,21.3454,0.5531,0.0000,0.0000,0.1983,0.0083,0.0000,0.0000,0.1035,0.0173,0.0000,0.0000,983.1039,0.0000,0.0000,0.0000,0.0000,0.0000,0.0000,0.0000,0.0000,0.0000,0.0000,0.0000,4.3655,0.0822,0.0000,0.0000,82.9437,1.5626,0.0000,0.0000,1.0539,0.0201,0.0000,0.0000,20.0237,0.3820,0.0000,0.0000
2029.75,285,60.2000,157.9941,51.5302,2.7121,49.3321,8.2077,0.0000,0.0000,0.0000,0.0000,0.0000,0.0000,0.0000,0.0000,0.0000,0.0000,0.0000,0.0000,0.0000,0.0000,54.1078,1.9327,0.0000,0.0000,54.1078,1.9327,0.0000,0.0000,0.0000,0.0000,0.0000,0.0000,0.0000,0.0000,0.0000,0.0000,28.4350,0.6355,0.0000,0.0000,0.2170,0.0088,0.0000,0.0000,49.3321,8.2077,0.0000,0.0000,0.0000,0.0000,0.0000,0.0000,0.0000,0.0000,0.0000,0.0000,0.0000,0.0000,0.0000,0.0000,1.6264,0.0668,0.0000,0.0000,30.9007,1.2692,0.0000,0.0000,0.5037,0.0207,0.0000,0.0000,9.5699,0.3929,0.0000,0.0000
2030.75,288,59.1000,983.5128,118.8737,6.2565,0.0977,0.0163,0.0000,0.0000,930.8978,14.8871,0.0000,0.0000,930.8978,14.8871,0.0000,0.0000,0.0000,0.0000,0.0000,0.0000,9.7989,0.1567,0.0000,0.0000,39.1957,0.6268,0.0000,0.0000,0.0000,11.2000,0.0000,0.0000,0.0000,0.0000,0.0000,0.0000,27.4211,0.5521,0.0000,0.0000,0.2968,0.0122,0.0000,0.0000,0.0977,0.0163,0.0000,0.0000,930.8978,0.0000,0.0000,0.0000,0.0000,0.0000,0.0000,0.0000,0.0000,0.0000,0.0000,0.0000,4.2689,0.0805,0.0000,0.0000,81.1091,1.5301,0.0000,0.0000,1.0317,0.0195,0.0000,0.0000,19.6018,0.3706,0.0000,0.0000
