    time,     N2Oflux,      NOflux,      N2flux,    CH4_oxid,         NIT,      ANNPPT
 2008.92,    1.464808,    1.100942,    0.546442,    0.166460,   10.559360,  130.899979
 2009.92,    1.918470,    1.519730,    0.961416,    0.170820,   13.390659,  119.799988
 2010.92,    1.500829,    1.471184,    0.888442,    0.206555,    6.844418,   99.899979
 2011.92,    1.083572,    0.928241,    0.201028,    0.212038,    9.193421,   96.599968
 2012.92,    1.267596,    1.372313,    0.430650,    0.193067,    6.513698,   91.300011
 2013.92,    1.092859,    0.791910,    0.279350,    0.172818,    9.269826,  107.299965
 2014.92,    1.132947,    1.041137,    0.405302,    0.162549,    6.025925,  116.999954
 2015.92,    1.122408,    0.805304,    0.236315,    0.175301,    9.586134,  128.499969
 2016.92,    1.099496,    1.045148,    0.356055,    0.176303,    6.276393,  106.099983
 2017.92,    1.347855,    1.433987,    0.321607,    0.206469,   13.439448,   90.499985
 2018.92,    1.214840,    1.196811,    0.641025,    0.183746,    5.848593,  130.509979
 2019.92,    1.264581,    0.960262,    0.249826,    0.166000,   11.185740,  128.499969
 2020.92,    0.652019,    0.720134,    0.120516,    0.204475,    4.838708,   79.603577
 2021.92,    1.103052,    0.866245,    0.246950,    0.172326,   10.137943,  130.899979
 2022.92,    0.781563,    0.706010,    0.282717,    0.172690,    5.011821,  119.799988
 2023.92,    1.126881,    0.893848,    0.158285,    0.201136,   11.134313,   99.899979
 2024.92,    0.614009,    0.657367,    0.149822,    0.216817,    4.055406,   96.599968
 2025.92,    0.975204,    0.949022,    0.191367,    0.190261,    9.304054,   91.300011
 2026.92,    0.661860,    0.597172,    0.227892,    0.176292,    4.215922,  107.299965
 2027.92,    1.145166,    0.836276,    0.221915,    0.158578,   10.916233,  116.999954
 2028.92,    0.678698,    0.633415,    0.194209,    0.180783,    4.489762,  128.499969
 2029.92,    1.090873,    0.848352,    0.190976,    0.171878,   10.540495,  106.099983
 2030.92,    0.529992,    0.628726,    0.111509,    0.212634,    4.001761,   90.499985
