rowid,Genotype ,Fertilization_level,Plot,Depth,Inside_or_outside_row,Percent_N,Percent_C,Notes,C:N
1,TAM08001,0,101,0-10,inside,0.837880221,40.13400715,,47.89945646
2,TAM08001,0,209,0-10,inside,0.755376943,37.46796728,,49.60168251
3,TAM08001,0,209,30-50,inside,0.563009405,41.48444345,,73.68339332
4,TAM08001,0,301,0-10,inside,0.56414471,41.06878491,,72.79831613
5,TAM08001,0,301,30-50,inside,0.700731724,38.96012167,,55.59919771
6,TAM08001,0,416,0-10,inside,0.774653166,36.08058255,,46.57643463
7,TAM08001,0,416,30-50,inside,0.73324297,37.63970389,,51.33319432
8,TAM08001,0,101,30-50,inside,0.406655146,37.62382654,,92.5202272
9,TAM08001,0,101,0-10,outside,0.615409497,49.43503965,,80.32869148
10,TAM08001,0,101,30-50,outside,0.240194222,35.57206496,,148.0970888
11,TAM08001,0,209,0-10,outside,0.539511109,42.63280031,,79.02117227
12,TAM08001,0,209,30-50,outside,0.779326363,44.14771897,,56.64856348
13,TAM08001,0,301,0-10,outside,0.73442566,41.84959352,,56.98274967
14,TAM08001,0,301,30-50,outside,0.357188287,39.55354923,,110.7358519
15,TAM08001,0,416,0-10,outside,0.431813592,40.68514989,,94.21924332
16,TAM08001,0,416,30-50,outside,0.537237072,39.41321888,,73.36280561
17,TAM08001,150,116,0-10,inside,1.570690857,56.4465947,,35.93743126
18,TAM08001,150,116,30-50,inside,1.208710397,42.02966577,,34.77232088
19,TAM08001,150,207,30-50,inside,0.475471493,38.99986652,,82.0235641
20,TAM08001,150,116,0-10,outside,1.050981715,40.81995453,,38.83983322
21,TAM08001,150,116,30-50,outside,0.95405311,37.79946169,,39.61987158
22,TAM08001,150,207,0-10,outside,0.420139383,39.31215006,,93.56930498
23,TAM08001,150,207,30-50,outside,0.442091623,38.00817914,,85.97353395
24,TAM08001,150,315,0-10,outside,0.674556935,41.55875571,,61.60896661
25,TAM08001,150,315,30-50,outside,0.904999726,42.37922691,,46.82788921
26,TAM08001,150,407,0-10,outside,0.612452199,39.96973287,,65.26179993
27,TAM08001,150,407,30-50,outside,1.017849161,43.66530094,,42.89957944
