Treatment,dSOC (gC/m2),N2O (gN2O-N/m2),dSOC (gCO2e/m2),N2O (gCO2e/m2),Total (gCO2e/m2),Total (gCO2e/m2/yr),Nleach(gNO3-N/m2/yr)
000_noBNI_2019,42.9531000000002,0.750895,157.494700000001,353.993357142857,511.488057142858,511.488057142858,1.616415
000_measBNI_2019,42.8719999999998,0.740725,157.197333333333,349.198928571429,506.396261904762,506.396261904762,1.61594
000_maxBNI_2019,42.7546000000002,0.719079,156.766866666667,338.994385714286,495.761252380953,495.761252380953,1.615106
050_noBNI_2019,40.1887000000002,0.991381,147.358566666667,467.365328571429,614.723895238096,614.723895238096,1.65232
050_measBNI_2019,40.1306,0.978942,147.145533333333,461.501228571428,608.646761904761,608.646761904761,1.6518
050_maxBNI_2019,40.0688,0.94732,146.918933333333,446.593714285714,593.512647619047,593.512647619047,1.650632
100_noBNI_2019,37.2154999999998,1.264581,136.456833333333,596.159614285714,732.616447619047,732.616447619047,1.678895
100_measBNI_2019,37.2116000000001,1.241901,136.442533333334,585.467614285714,721.910147619048,721.910147619048,1.677845
100_maxBNI_2019,37.2157999999999,1.189436,136.457933333333,560.734114285714,697.192047619047,697.192047619047,1.675917
150_noBNI_2019,37.6750000000002,1.701163,138.141666666667,801.976842857143,940.11850952381,940.11850952381,1.697605
150_measBNI_2019,37.6758,1.669867,138.1446,787.223014285714,925.367614285714,925.367614285714,1.696039
150_maxBNI_2019,37.6797000000001,1.533981,138.1589,723.162471428571,861.321371428571,861.321371428571,1.690299
