Treatment,dSOC (gC/m2),N2O (gN2O-N/m2),dSOC (gCO2e/m2),N2O (gCO2e/m2),Total (gCO2e/m2),Total (gCO2e/m2/yr),Nleach(gNO3-N/m2/yr)
000_noBNI_2019,434.0446,6.977924,1591.49686666667,3289.59274285714,4881.08960952381,406.757467460318,0.736383333333333
000_measBNI_2019,433.7622,6.931184,1590.4614,3267.55817142857,4858.01957142857,404.834964285714,0.733774416666667
000_maxBNI_2019,433.2654,6.845326,1588.6398,3227.08225714286,4815.72205714286,401.310171428572,0.7289425
050_noBNI_2019,407.6811,8.635601,1494.8307,4071.06904285714,5565.89974285714,463.824978571428,0.883240916666667
050_measBNI_2019,407.4331,8.57836,1493.92136666667,4044.084,5538.00536666667,461.500447222222,0.8801575
050_maxBNI_2019,406.9453,8.450479,1492.13276666667,3983.79724285714,5475.93000952381,456.327500793651,0.8734735
100_noBNI_2019,386.4038,10.623898,1416.81393333333,5008.40905714286,6425.22299047619,535.435249206349,1.03042625
100_measBNI_2019,386.1733,10.512019,1415.96876666667,4955.6661,6371.63486666667,530.969572222222,1.02424566666667
100_maxBNI_2019,385.4983,10.259354,1413.49376666667,4836.5526,6250.04636666667,520.837197222222,1.01099533333333
150_noBNI_2019,374.018,13.611165,1371.39933333333,6416.69207142857,7788.0914047619,649.007617063492,1.31634308333333
150_measBNI_2019,373.7837,13.454068,1370.54023333333,6342.63205714286,7713.17229047619,642.764357539682,1.30818716666667
150_maxBNI_2019,372.6833,12.848217,1366.50543333333,6057.01658571429,7423.52201904762,618.626834920635,1.27720741666667
