Treatment,Time,year,dayofyr,NH4,NO3_15cm,NO3_30cm,NO3_45cm,NO3_105cm,NO3_180cm
000_noBNI_2018,2018.38524590164,2018,141,3.20378,8.80035,23.0899,26.13237,36.75096,42.23709
000_noBNI_2018,2019.38524590164,2019,141,3.59124,6.67678,15.48596,17.28657,27.7253,35.84769
000_measBNI_2018,2018.38524590164,2018,141,3.20378,8.80035,23.0899,26.13237,36.75096,42.23709
000_measBNI_2018,2019.38524590164,2019,141,3.59174,6.67637,15.48547,17.2862,27.69705,35.81081
000_maxBNI_2018,2018.38524590164,2018,141,3.20378,8.80035,23.0899,26.13237,36.75096,42.23709
000_maxBNI_2018,2019.38524590164,2019,141,3.59784,6.68612,15.51638,17.31692,27.44712,35.47841
100_noBNI_2018,2018.38524590164,2018,141,3.20378,8.80035,23.0899,26.13237,36.75096,42.23709
100_noBNI_2018,2019.38524590164,2019,141,4.15523,7.75153,19.01208,21.33357,36.38969,46.11144
100_measBNI_2018,2018.38524590164,2018,141,3.20378,8.80035,23.0899,26.13237,36.75096,42.23709
100_measBNI_2018,2019.38524590164,2019,141,4.15618,7.75318,19.01754,21.33985,36.3534,46.06171
100_maxBNI_2018,2018.38524590164,2018,141,3.20378,8.80035,23.0899,26.13237,36.75096,42.23709
100_maxBNI_2018,2019.38524590164,2019,141,4.172,7.79316,19.13022,21.4599,35.98886,45.54891
