<?xml version="1.0" encoding="UTF-8" standalone="no"?>
<!-- Created with Inkscape (http://www.inkscape.org/) -->

<svg
   width="210.35689mm"
   height="171.36293mm"
   viewBox="0 0 210.35689 171.36293"
   version="1.1"
   id="svg5"
   inkscape:version="1.1.1 (1:1.1+202109281949+c3084ef5ed)"
   sodipodi:docname="html_semantico.svg"
   xmlns:inkscape="http://www.inkscape.org/namespaces/inkscape"
   xmlns:sodipodi="http://sodipodi.sourceforge.net/DTD/sodipodi-0.dtd"
   xmlns="http://www.w3.org/2000/svg"
   xmlns:svg="http://www.w3.org/2000/svg">
  <sodipodi:namedview
     id="namedview7"
     pagecolor="#ffffff"
     bordercolor="#666666"
     borderopacity="1.0"
     inkscape:pageshadow="2"
     inkscape:pageopacity="0.0"
     inkscape:pagecheckerboard="0"
     inkscape:document-units="mm"
     showgrid="false"
     inkscape:zoom="0.37415825"
     inkscape:cx="652.13048"
     inkscape:cy="280.62992"
     inkscape:window-width="1920"
     inkscape:window-height="1056"
     inkscape:window-x="1680"
     inkscape:window-y="0"
     inkscape:window-maximized="1"
     inkscape:current-layer="layer1"
     fit-margin-top="0"
     fit-margin-left="0"
     fit-margin-right="0"
     fit-margin-bottom="0" />
  <defs
     id="defs2">
    <marker
       style="overflow:visible"
       id="Arrow1Lstart"
       refX="0"
       refY="0"
       orient="auto"
       inkscape:stockid="Arrow1Lstart"
       inkscape:isstock="true">
      <path
         transform="matrix(0.8,0,0,0.8,10,0)"
         style="fill:context-stroke;fill-rule:evenodd;stroke:context-stroke;stroke-width:1pt"
         d="M 0,0 5,-5 -12.5,0 5,5 Z"
         id="path1254" />
    </marker>
  </defs>
  <g
     inkscape:label="Capa 1"
     inkscape:groupmode="layer"
     id="layer1"
     transform="translate(0.13160644,-0.11854668)">
    <rect
       style="fill:#f47d78;fill-opacity:1;stroke:#020603;stroke-width:0.282799;stroke-linecap:butt;stroke-linejoin:round;stroke-miterlimit:3.1;stroke-dasharray:none;stroke-dashoffset:0;stroke-opacity:1;paint-order:markers fill stroke"
       id="rect846"
       width="210.07634"
       height="20.817072"
       x="0.0097981906"
       y="0.25994608"
       ry="0" />
    <text
       xml:space="preserve"
       style="font-style:normal;font-weight:normal;font-size:10.5833px;line-height:1.25;font-family:sans-serif;letter-spacing:0px;word-spacing:0px;fill:#000000;fill-opacity:1;stroke:none;stroke-width:0.264583"
       x="77.490135"
       y="14.681383"
       id="text11821"><tspan
         sodipodi:role="line"
         id="tspan11819"
         style="stroke-width:0.264583"
         x="77.490135"
         y="14.681383">&lt;header&gt;</tspan></text>
    <rect
       style="fill:#6be1ea;fill-opacity:1;stroke:#020603;stroke-width:0.282793;stroke-linecap:butt;stroke-linejoin:round;stroke-miterlimit:3.1;stroke-dasharray:none;stroke-dashoffset:0;stroke-opacity:1;paint-order:markers fill stroke"
       id="rect846-3"
       width="210.06755"
       height="20.817078"
       x="0.0097920736"
       y="21.077341"
       ry="0" />
    <text
       xml:space="preserve"
       style="font-style:normal;font-weight:normal;font-size:10.5833px;line-height:1.25;font-family:sans-serif;letter-spacing:0px;word-spacing:0px;fill:#000000;fill-opacity:1;stroke:none;stroke-width:0.264583"
       x="77.490135"
       y="35.498779"
       id="text11821-6"><tspan
         sodipodi:role="line"
         id="tspan11819-7"
         style="stroke-width:0.264583"
         x="77.490135"
         y="35.498779">&lt;nav&gt;</tspan></text>
    <rect
       style="fill:#23870a;fill-opacity:1;stroke:#020603;stroke-width:0.553675;stroke-linecap:butt;stroke-linejoin:round;stroke-miterlimit:3.1;stroke-dasharray:none;stroke-dashoffset:0;stroke-opacity:1;paint-order:markers fill stroke"
       id="rect846-5"
       width="154.71358"
       height="108.34842"
       x="0.14523105"
       y="42.030178"
       ry="0" />
    <text
       xml:space="preserve"
       style="font-style:normal;font-weight:normal;font-size:10.5833px;line-height:1.25;font-family:sans-serif;letter-spacing:0px;word-spacing:0px;fill:#000000;fill-opacity:1;stroke:none;stroke-width:0.264583"
       x="7.2447815"
       y="55.177521"
       id="text11821-3"><tspan
         sodipodi:role="line"
         id="tspan11819-5"
         style="stroke-width:0.264583"
         x="7.2447815"
         y="55.177521">&lt;main&gt;</tspan></text>
    <rect
       style="fill:#eaa244;fill-opacity:1;stroke:#020603;stroke-width:0.330833;stroke-linecap:butt;stroke-linejoin:round;stroke-miterlimit:3.1;stroke-dasharray:none;stroke-dashoffset:0;stroke-opacity:1;paint-order:markers fill stroke"
       id="rect846-6"
       width="55.176876"
       height="108.46849"
       x="154.883"
       y="42.054356"
       ry="0" />
    <text
       xml:space="preserve"
       style="font-style:normal;font-weight:normal;font-size:10.5833px;line-height:1.25;font-family:sans-serif;letter-spacing:0px;word-spacing:0px;fill:#000000;fill-opacity:1;stroke:none;stroke-width:0.264583"
       x="155.41666"
       y="100.23409"
       id="text11821-2"><tspan
         sodipodi:role="line"
         id="tspan11819-9"
         style="stroke-width:0.264583"
         x="155.41666"
         y="100.23409">&lt;aside&gt;</tspan></text>
    <rect
       style="fill:#75eb5b;fill-opacity:1;stroke:#020603;stroke-width:0.470753;stroke-linecap:butt;stroke-linejoin:round;stroke-miterlimit:3.1;stroke-dasharray:none;stroke-dashoffset:0;stroke-opacity:1;paint-order:markers fill stroke"
       id="rect846-1"
       width="145.25867"
       height="83.422844"
       x="3.9572389"
       y="62.227806"
       ry="0" />
    <text
       xml:space="preserve"
       style="font-style:normal;font-weight:normal;font-size:10.5833px;line-height:1.25;font-family:sans-serif;letter-spacing:0px;word-spacing:0px;fill:#000000;fill-opacity:1;stroke:none;stroke-width:0.264583"
       x="5.8498383"
       y="72.85244"
       id="text11821-27"><tspan
         sodipodi:role="line"
         id="tspan11819-0"
         style="stroke-width:0.264583"
         x="5.8498383"
         y="72.85244">&lt;article&gt;</tspan></text>
    <rect
       style="fill:#adeeac;fill-opacity:1;stroke:#020603;stroke-width:0.231115;stroke-linecap:butt;stroke-linejoin:round;stroke-miterlimit:3.1;stroke-dasharray:none;stroke-dashoffset:0;stroke-opacity:1;paint-order:markers fill stroke"
       id="rect846-9"
       width="139.95972"
       height="20.868755"
       x="6.5912743"
       y="79.30201"
       ry="0" />
    <text
       xml:space="preserve"
       style="font-style:normal;font-weight:normal;font-size:10.5833px;line-height:1.25;font-family:sans-serif;letter-spacing:0px;word-spacing:0px;fill:#000000;fill-opacity:1;stroke:none;stroke-width:0.264583"
       x="11.334685"
       y="93.68187"
       id="text11821-36"><tspan
         sodipodi:role="line"
         id="tspan11819-06"
         style="stroke-width:0.264583"
         x="11.334685"
         y="93.68187">&lt;section&gt;</tspan></text>
    <rect
       style="fill:#adeeac;fill-opacity:1;stroke:#020603;stroke-width:0.231115;stroke-linecap:butt;stroke-linejoin:round;stroke-miterlimit:3.1;stroke-dasharray:none;stroke-dashoffset:0;stroke-opacity:1;paint-order:markers fill stroke"
       id="rect846-9-7"
       width="139.95972"
       height="20.868755"
       x="6.5912724"
       y="101.75827"
       ry="0" />
    <text
       xml:space="preserve"
       style="font-style:normal;font-weight:normal;font-size:10.5833px;line-height:1.25;font-family:sans-serif;letter-spacing:0px;word-spacing:0px;fill:#000000;fill-opacity:1;stroke:none;stroke-width:0.264583"
       x="11.334682"
       y="116.13814"
       id="text11821-36-9"><tspan
         sodipodi:role="line"
         id="tspan11819-06-2"
         style="stroke-width:0.264583"
         x="11.334682"
         y="116.13814">&lt;section&gt;</tspan></text>
    <rect
       style="fill:#6f6f6f;fill-opacity:1;stroke:#020603;stroke-width:0.28278;stroke-linecap:butt;stroke-linejoin:round;stroke-miterlimit:3.1;stroke-dasharray:none;stroke-dashoffset:0;stroke-opacity:1;paint-order:markers fill stroke"
       id="rect846-2"
       width="210.04474"
       height="20.817381"
       x="0.039903313"
       y="150.52286"
       ry="0" />
    <text
       xml:space="preserve"
       style="font-style:normal;font-weight:normal;font-size:10.5833px;line-height:1.25;font-family:sans-serif;letter-spacing:0px;word-spacing:0px;fill:#000000;fill-opacity:1;stroke:none;stroke-width:0.264583"
       x="77.951088"
       y="164.94444"
       id="text11821-61"><tspan
         sodipodi:role="line"
         id="tspan11819-8"
         style="stroke-width:0.264583"
         x="77.951088"
         y="164.94444">&lt;footer&gt;</tspan></text>
  </g>
</svg>
