<svg id="Layer_1" data-name="Layer 1" xmlns="http://www.w3.org/2000/svg" viewBox="0 0 674.29 137.39">
  <defs>
    <style>
      .cls-1 {
        fill: #2cb49b;
      }

      .cls-2 {
        fill: #415b7f;
      }
    </style>
  </defs>
  <title>webtweaker_logo_final_outlined</title>
  <g>
    <g>
      <g>
        <path class="cls-1" d="M451,246.1H435v57.43a2,2,0,0,1-2,2H420.14a2,2,0,0,1-2-2V246.1H402.08a1.9,1.9,0,0,1-2-1.87V234.07a1.9,1.9,0,0,1,2-1.87H451a2,2,0,0,1,2.07,1.87v10.16A2,2,0,0,1,451,246.1Z" transform="translate(-174.85 -231.3)"/>
        <path class="cls-1" d="M541.61,233.67l-9.18,64.63c-.79,5.72-3.85,7.5-9.08,7.5h-5.62c-4.34,0-7.8-1.68-9.08-6.71l-7.8-29.5c-.2-.79-.4-.79-.89-.79s-.59,0-.79.79l-7.8,29.5c-1.28,5-4.74,6.71-9.08,6.71h-5.62c-5.23,0-8.29-1.78-9.08-7.5l-9.18-64.63v-.2c0-1,.79-1.28,1.58-1.28h13.42a1.84,1.84,0,0,1,1.58,1.87L480.63,287c.1.89.2,1.28.59,1.28s.49-.4.69-1.28L489,259.82c1-3.75,3.45-4.74,6.12-4.74h9.77c2.66,0,5.13,1,6.12,4.74L518.13,287c.2.89.4,1.28.69,1.28s.49-.4.59-1.28L525,234.07a1.84,1.84,0,0,1,1.58-1.87H540c.79,0,1.58.29,1.58,1.28Z" transform="translate(-174.85 -231.3)"/>
        <path class="cls-1" d="M592.05,305.11a116.26,116.26,0,0,1-19.14,1.28c-12.73,0-24-3.26-24-21.22V252.42c0-18,11.35-21.12,24.07-21.12a114.75,114.75,0,0,1,19,1.28c1.38.2,2,.69,2,2v9.18a2,2,0,0,1-2,2H572c-4.64,0-6.31,1.58-6.31,6.71v9h25.56a2,2,0,0,1,2,2v9.37a2,2,0,0,1-2,2H565.71v10.46c0,5.13,1.68,6.71,6.31,6.71h20a2,2,0,0,1,2,2V303C594,304.32,593.44,304.91,592.05,305.11Z" transform="translate(-174.85 -231.3)"/>
        <path class="cls-1" d="M662,305.5H648.21a2.1,2.1,0,0,1-2-1.78l-3.55-16.18H622.46l-3.55,16.18a2.1,2.1,0,0,1-2,1.78H603.12a1.53,1.53,0,0,1-1.68-1.58,4.31,4.31,0,0,0,.1-.49l14.7-61.18c2.27-9.47,9.57-11,16.38-11s14,1.48,16.28,11l14.7,61.18a4.31,4.31,0,0,0,.1.49A1.53,1.53,0,0,1,662,305.5ZM633.9,246.79c-.2-1-.39-1.48-1.28-1.48s-1.18.49-1.38,1.48l-6,27.23h14.7Z" transform="translate(-174.85 -231.3)"/>
        <path class="cls-1" d="M729.43,234.66,705.95,268l23.58,35.42a1.84,1.84,0,0,1,.4,1.09c0,.59-.49,1-1.38,1h-17a2.32,2.32,0,0,1-2.17-1.38l-20-32.56v32a2,2,0,0,1-2,2H674.47a2,2,0,0,1-2-2V234.07a1.9,1.9,0,0,1,2-1.87H687.4a1.9,1.9,0,0,1,2,1.87v31.38l21.71-32.07a2.27,2.27,0,0,1,2.17-1.18h15.1c1.09,0,1.58.49,1.58,1.09A2.92,2.92,0,0,1,729.43,234.66Z" transform="translate(-174.85 -231.3)"/>
        <path class="cls-1" d="M778.09,305.11a116.32,116.32,0,0,1-19.14,1.28c-12.73,0-24-3.26-24-21.22V252.42c0-18,11.35-21.12,24.07-21.12a114.81,114.81,0,0,1,19,1.28c1.38.2,2,.69,2,2v9.18a2,2,0,0,1-2,2h-20c-4.64,0-6.31,1.58-6.31,6.71v9H777.3a2,2,0,0,1,2,2v9.37a2,2,0,0,1-2,2H751.75v10.46c0,5.13,1.68,6.71,6.31,6.71h20a2,2,0,0,1,2,2V303C780.06,304.32,779.47,304.91,778.09,305.11Z" transform="translate(-174.85 -231.3)"/>
        <path class="cls-1" d="M847.67,305.5h-15.1c-1.09,0-1.48-1-2-2l-13.22-25-1.09.1c-2.07,0-5.13-.2-7-.2v25.06a2,2,0,0,1-2,2H794.48a2,2,0,0,1-2-2V237.32c0-3.35,1.38-4.24,4.44-4.74a156.25,156.25,0,0,1,20-1.28c16.77,0,29.7,5.62,29.7,23.09v1.28c0,10.46-5.52,16.87-12.73,19.74l14.9,27.83a2.55,2.55,0,0,1,.3,1.09C849.15,305,848.75,305.5,847.67,305.5Zm-17.76-51.11c0-6-4.64-8.78-12.92-8.78-1.38,0-6.51.2-7.7.3v18.94c1.09.1,5.92.2,7,.2,10.36,0,13.62-2.66,13.62-9.37Z" transform="translate(-174.85 -231.3)"/>
      </g>
      <g>
        <path class="cls-2" d="M258,233.67l-9.18,64.63c-.79,5.72-3.85,7.5-9.08,7.5h-5.62c-4.34,0-7.8-1.68-9.08-6.71l-7.8-29.5c-.2-.79-.4-.79-.89-.79s-.59,0-.79.79l-7.8,29.5c-1.28,5-4.74,6.71-9.08,6.71h-5.62c-5.23,0-8.29-1.78-9.08-7.5l-9.18-64.63v-.2c0-1,.79-1.28,1.58-1.28h13.42a1.84,1.84,0,0,1,1.58,1.87L197.06,287c.1.89.2,1.28.59,1.28s.49-.4.69-1.28l7.11-27.14c1-3.75,3.45-4.74,6.12-4.74h9.77c2.66,0,5.13,1,6.12,4.74L234.55,287c.2.89.4,1.28.69,1.28s.49-.4.59-1.28l5.62-52.89a1.84,1.84,0,0,1,1.58-1.87h13.42c.79,0,1.58.29,1.58,1.28Z" transform="translate(-174.85 -231.3)"/>
        <path class="cls-2" d="M308.48,305.11a116.32,116.32,0,0,1-19.14,1.28c-12.73,0-24-3.26-24-21.22V252.42c0-18,11.35-21.12,24.07-21.12a114.81,114.81,0,0,1,19,1.28c1.38.2,2,.69,2,2v9.18a2,2,0,0,1-2,2h-20c-4.64,0-6.31,1.58-6.31,6.71v9h25.56a2,2,0,0,1,2,2v9.37a2,2,0,0,1-2,2H282.13v10.46c0,5.13,1.68,6.71,6.31,6.71h20a2,2,0,0,1,2,2V303C310.45,304.32,309.86,304.91,308.48,305.11Z" transform="translate(-174.85 -231.3)"/>
        <path class="cls-2" d="M346.38,306.39a124.88,124.88,0,0,1-18.06-1.19c-3.95-.69-5.43-2-5.43-6.41v-60c0-4.44,1.38-5.82,5.23-6.41a152.6,152.6,0,0,1,17.66-1.09c18.65,0,31.18,4.93,31.18,20.62v1.78c0,6.41-3.06,11.94-8.29,14.5a15.75,15.75,0,0,1,8.78,14.6v1.48C377.46,301.66,363.45,306.39,346.38,306.39ZM360.68,253c0-5.43-3.45-7.89-13.62-7.89-1.58,0-6.12,0-7.5.1v17.07h11.05c7.8,0,10.06-3.55,10.06-7.8Zm.4,29.8c0-4.74-2.57-8.78-10.46-8.78H339.57v18.45c1.58,0,6.71.1,8.09.1,10.16,0,13.42-3.16,13.42-8.68Z" transform="translate(-174.85 -231.3)"/>
      </g>
    </g>
    <g>
      <path class="cls-2" d="M427,335.47l-9.49,15.46v10.26H414.2V350.93l-9.42-15.46h3.51l7.57,12.43,7.6-12.43Z" transform="translate(-174.85 -231.3)"/>
      <path class="cls-2" d="M438.88,361.61a10.28,10.28,0,0,1-7.5-3,9.94,9.94,0,0,1-3-7.4,10.44,10.44,0,0,1,1.36-5.31,9.69,9.69,0,0,1,3.78-3.7,11.46,11.46,0,0,1,10.74,0A9.74,9.74,0,0,1,448,346a10.92,10.92,0,0,1,0,10.6,9.73,9.73,0,0,1-3.78,3.71A10.9,10.9,0,0,1,438.88,361.61Zm-5.25-5.08a7.75,7.75,0,1,0-2.06-5.26A7.1,7.1,0,0,0,433.63,356.53Z" transform="translate(-174.85 -231.3)"/>
      <path class="cls-2" d="M464.43,361.61a8.25,8.25,0,0,1-8.79-8.81V341.35h3.12v11a6.61,6.61,0,0,0,1.52,4.61,5.93,5.93,0,0,0,8.29,0,6.65,6.65,0,0,0,1.52-4.6v-11h3.12v11.46a8.24,8.24,0,0,1-8.79,8.81Z" transform="translate(-174.85 -231.3)"/>
      <path class="cls-2" d="M490.08,341.24h1.76v3h-2a5.34,5.34,0,0,0-4.18,1.65,6.55,6.55,0,0,0-1.49,4.55v10.78H481V341.35h2.22l.5,3A7.22,7.22,0,0,1,490.08,341.24Z" transform="translate(-174.85 -231.3)"/>
      <path class="cls-2" d="M522.05,347.84a6.06,6.06,0,0,1,2.81,2.46,7.14,7.14,0,0,1,1,3.8,6.55,6.55,0,0,1-2.24,5,7.92,7.92,0,0,1-5.54,2H507.81V335.47H518a7.39,7.39,0,0,1,5.19,1.88,6.12,6.12,0,0,1,2.05,4.7,7,7,0,0,1-.86,3.35A6.12,6.12,0,0,1,522.05,347.84Zm-.12-5.36a3.64,3.64,0,0,0-1.17-2.74,4,4,0,0,0-2.87-1.11H511v7.71h6.9a4,4,0,0,0,2.86-1.12A3.66,3.66,0,0,0,521.93,342.48ZM518.07,358a4.47,4.47,0,0,0,3.21-1.21,4.24,4.24,0,0,0,0-6.07,4.46,4.46,0,0,0-3.2-1.22H511V358Z" transform="translate(-174.85 -231.3)"/>
      <path class="cls-2" d="M541.84,341.24h1.76v3h-2a5.34,5.34,0,0,0-4.18,1.65,6.55,6.55,0,0,0-1.49,4.55v10.78h-3.14V341.35H535l.5,3A7.22,7.22,0,0,1,541.84,341.24Z" transform="translate(-174.85 -231.3)"/>
      <path class="cls-2" d="M565.05,341.35h2.49v19.83H565l-.34-3a9.67,9.67,0,0,1-3.4,2.54,10.51,10.51,0,0,1-4.38.91,10.34,10.34,0,0,1-5.24-1.35,9.67,9.67,0,0,1-3.69-3.72,10.59,10.59,0,0,1-1.34-5.28,10.07,10.07,0,0,1,2.93-7.4,9.91,9.91,0,0,1,7.33-3,10.61,10.61,0,0,1,4.41.91,9.62,9.62,0,0,1,3.42,2.56Zm-13.2,15.15a7.54,7.54,0,0,0,10.43,0,7.68,7.68,0,0,0,0-10.49,7.54,7.54,0,0,0-10.43,0,7.63,7.63,0,0,0,0,10.47Z" transform="translate(-174.85 -231.3)"/>
      <path class="cls-2" d="M585.58,340.92a7.08,7.08,0,0,1,5.57,2.35,8.75,8.75,0,0,1,2.09,6v11.87h-3.12V350a7,7,0,0,0-1.38-4.64,4.9,4.9,0,0,0-4-1.63,5.53,5.53,0,0,0-4.27,1.9,6.74,6.74,0,0,0-1.72,4.7v10.81h-3.14V341.35h2.22l.61,3.1a7.74,7.74,0,0,1,3-2.6A9,9,0,0,1,585.58,340.92Z" transform="translate(-174.85 -231.3)"/>
      <path class="cls-2" d="M617.06,334.27h3.12v26.92h-2.42l-.41-2.82a9.65,9.65,0,0,1-3.37,2.39,10.65,10.65,0,0,1-4.27.85,9.82,9.82,0,0,1-7.33-3,10.15,10.15,0,0,1-2.89-7.4,10.8,10.8,0,0,1,1.3-5.3,9.48,9.48,0,0,1,3.64-3.7,10.41,10.41,0,0,1,5.28-1.34,10.63,10.63,0,0,1,4.07.77,9.89,9.89,0,0,1,3.28,2.17Zm-12.31,22.25a7.53,7.53,0,0,0,10.43,0,7.62,7.62,0,0,0,0-10.46,7.54,7.54,0,0,0-10.43,0,7.68,7.68,0,0,0,0,10.49Z" transform="translate(-174.85 -231.3)"/>
      <path class="cls-2" d="M628.16,337.92v-3.59h3.39v3.59Zm.13,23.26V341.35h3.14v19.83Z" transform="translate(-174.85 -231.3)"/>
      <path class="cls-2" d="M649.46,340.92a7.08,7.08,0,0,1,5.57,2.35,8.75,8.75,0,0,1,2.09,6v11.87H654V350a7,7,0,0,0-1.38-4.64,4.9,4.9,0,0,0-4-1.63,5.53,5.53,0,0,0-4.27,1.9,6.74,6.74,0,0,0-1.72,4.7v10.81h-3.14V341.35h2.22l.61,3.1a7.74,7.74,0,0,1,3-2.6A9,9,0,0,1,649.46,340.92Z" transform="translate(-174.85 -231.3)"/>
      <path class="cls-2" d="M681.32,341.35h2.08V358.4a10.53,10.53,0,0,1-2.6,7.55,9.34,9.34,0,0,1-7.12,2.74,10.18,10.18,0,0,1-6.12-1.78,8.45,8.45,0,0,1-3.28-5h3.12a5.33,5.33,0,0,0,2.36,2.86,7.44,7.44,0,0,0,3.92,1,6.44,6.44,0,0,0,4.84-1.88,7.07,7.07,0,0,0,1.83-5.15V357.6a9.45,9.45,0,0,1-3.21,2.18,10.29,10.29,0,0,1-4,.78,9.73,9.73,0,0,1-4.95-1.29,9.36,9.36,0,0,1-3.52-3.54,10.32,10.32,0,0,1,0-10,9.35,9.35,0,0,1,3.52-3.55,9.74,9.74,0,0,1,4.95-1.29,10.15,10.15,0,0,1,4.35.93,9.52,9.52,0,0,1,3.36,2.58Zm-12.79,14.27a7.23,7.23,0,0,0,9.85,0,6.83,6.83,0,0,0-4.91-11.72,6.73,6.73,0,0,0-4.94,1.95,7,7,0,0,0,0,9.76Z" transform="translate(-174.85 -231.3)"/>
      <path class="cls-2" d="M712.55,335.47a8.43,8.43,0,0,1,6.09,2.36,8.31,8.31,0,0,1,0,11.77,8.44,8.44,0,0,1-6.1,2.35h-6v9.24h-3.21V335.47Zm-.18,13.36a5.41,5.41,0,0,0,3.89-1.45,5.16,5.16,0,0,0,0-7.33,5.4,5.4,0,0,0-3.89-1.46h-5.83v10.24Z" transform="translate(-174.85 -231.3)"/>
      <path class="cls-2" d="M743.89,341.35h2.49v19.83H743.8l-.34-3a9.67,9.67,0,0,1-3.4,2.54,10.51,10.51,0,0,1-4.38.91,10.34,10.34,0,0,1-5.24-1.35,9.67,9.67,0,0,1-3.69-3.72,10.59,10.59,0,0,1-1.34-5.28,10.07,10.07,0,0,1,2.93-7.4,9.91,9.91,0,0,1,7.33-3,10.61,10.61,0,0,1,4.41.91,9.62,9.62,0,0,1,3.42,2.56Zm-13.2,15.15a7.54,7.54,0,0,0,10.43,0,7.68,7.68,0,0,0,0-10.49,7.54,7.54,0,0,0-10.43,0,7.63,7.63,0,0,0,0,10.47Z" transform="translate(-174.85 -231.3)"/>
      <path class="cls-2" d="M763.55,341.24h1.76v3h-2a5.34,5.34,0,0,0-4.18,1.65,6.55,6.55,0,0,0-1.49,4.55v10.78h-3.14V341.35h2.22l.5,3A7.22,7.22,0,0,1,763.55,341.24Z" transform="translate(-174.85 -231.3)"/>
      <path class="cls-2" d="M778.71,358.3h2.15v2.89H778.3a6.78,6.78,0,0,1-5-1.86,6.91,6.91,0,0,1-1.84-5.08V344.17h-3.5v-.56l6.13-6.46h.48v4.2h6.22v2.82h-6.22v10a4.14,4.14,0,0,0,1.08,3.08A4.22,4.22,0,0,0,778.71,358.3Z" transform="translate(-174.85 -231.3)"/>
      <path class="cls-2" d="M796.8,340.92a7.08,7.08,0,0,1,5.57,2.35,8.75,8.75,0,0,1,2.09,6v11.87h-3.12V350A7,7,0,0,0,800,345.4a4.9,4.9,0,0,0-4-1.63,5.53,5.53,0,0,0-4.27,1.9,6.74,6.74,0,0,0-1.72,4.7v10.81h-3.14V341.35h2.22l.61,3.1a7.74,7.74,0,0,1,3-2.6A9,9,0,0,1,796.8,340.92Z" transform="translate(-174.85 -231.3)"/>
      <path class="cls-2" d="M830.81,351.36c0,.36,0,.73-.05,1.11H813.84a6.82,6.82,0,0,0,2.27,4.43,6.9,6.9,0,0,0,4.71,1.67,7.25,7.25,0,0,0,3.64-.91,6.69,6.69,0,0,0,2.53-2.52h3.3a10.49,10.49,0,0,1-3.76,4.77,9.85,9.85,0,0,1-5.71,1.7,10.09,10.09,0,0,1-5.16-1.35,9.61,9.61,0,0,1-3.64-3.71A11.25,11.25,0,0,1,812,346a9.59,9.59,0,0,1,3.64-3.72,10.1,10.1,0,0,1,5.16-1.34,9.86,9.86,0,0,1,5.24,1.4,9.4,9.4,0,0,1,3.52,3.78A11.3,11.3,0,0,1,830.81,351.36Zm-10-7.48a6.73,6.73,0,0,0-6.9,5.7h13.77a6.71,6.71,0,0,0-6.87-5.7Z" transform="translate(-174.85 -231.3)"/>
      <path class="cls-2" d="M846.38,341.24h1.76v3h-2a5.34,5.34,0,0,0-4.18,1.65,6.55,6.55,0,0,0-1.49,4.55v10.78H837.3V341.35h2.22l.5,3A7.22,7.22,0,0,1,846.38,341.24Z" transform="translate(-174.85 -231.3)"/>
    </g>
  </g>
</svg>
