%YAML 1.1
%TAG !u! tag:unity3d.com,2011:
--- !u!1045 &1
EditorBuildSettings:
  m_ObjectHideFlags: 0
  serializedVersion: 2
  m_Scenes:
  - enabled: 1
    path: Assets/Scenes/ParkingLot.unity
    guid: 2cda990e2423bbf4892e6590ba056729
  - enabled: 1
    path: Assets/Scenes/Default.unity
    guid: 0bb245fcabca919498c8a638f1cd8956
  - enabled: 1
    path: Assets/Scenes/Stage_one.unity
    guid: 35a3f6b66edcf1f4b81bc6b47b9e1ad2
  m_configObjects: {}
