\relax 
\@writefile{toc}{\contentsline {chapter}{\numberline {1}Espacios verticales}{1}}
\@writefile{lof}{\addvspace {10\p@ }}
\@writefile{lot}{\addvspace {10\p@ }}
\@writefile{toc}{\contentsline {chapter}{\numberline {2}Espacios horizontales}{2}}
\@writefile{lof}{\addvspace {10\p@ }}
\@writefile{lot}{\addvspace {10\p@ }}
\@writefile{toc}{\contentsline {paragraph}{P\IeC {\'a}rrafos}{2}}
\@writefile{toc}{\contentsline {section}{\numberline {2.1}Derecha}{2}}
\@writefile{toc}{\contentsline {section}{\numberline {2.2}Izquierda}{2}}
\@writefile{toc}{\contentsline {section}{\numberline {2.3}Centrado}{2}}
\@writefile{toc}{\contentsline {section}{\numberline {2.4}Citas}{2}}
