\relax 
\@writefile{toc}{\contentsline {chapter}{\numberline {1}Introducci\IeC {\'o}n a lenguajes de programaci\IeC {\'o}n}{1}}
\@writefile{lof}{\addvspace {10\p@ }}
\@writefile{lot}{\addvspace {10\p@ }}
\@writefile{toc}{\contentsline {section}{\numberline {1.1}Tipos de lenguajes}{1}}
\@writefile{toc}{\contentsline {section}{\numberline {1.2}Tipos de interpretes}{1}}
\@writefile{toc}{\contentsline {subsection}{\numberline {1.2.1}Ensambladores}{1}}
\@writefile{toc}{\contentsline {subsubsection}{Ensamblador Motorola}{1}}
\@writefile{toc}{\contentsline {paragraph}{1970-1990}{1}}
\@writefile{toc}{\contentsline {paragraph}{1990-2018}{1}}
\@writefile{toc}{\contentsline {subsection}{\numberline {1.2.2}Interpretes}{1}}
\@writefile{toc}{\contentsline {subsection}{\numberline {1.2.3}Compiladores}{1}}
\@writefile{toc}{\contentsline {chapter}{\numberline {2}Introducci\IeC {\'o}n a lenguajes de marcas}{5}}
\@writefile{lof}{\addvspace {10\p@ }}
\@writefile{lot}{\addvspace {10\p@ }}
