[
	{
		"question": "How often do you visit our site?",
		"type": "radio",
		"answers": [
			"A couple of times a month",
			"Once a week",
			"Few times a week",
			"Every day",
			"Several times a day"
		],
		"value": ""
	},
	{
		"question": "Are you comfortable using our site?",
		"type": "radio",
		"answers": [
			"Comfortable",
			"Not very comfortable",
			"Very uncomfortable"
		],
		"value": ""
	},
	{
		"question": "Tell us what exactly you do not like?",
		"type": "textarea",
		"value": ""
	},
	{
		"question": "What changes would you like?",
		"type": "checkbox",
		"answers": [
			"Design change",
			"Newsletter",
			"Online consultations",
			"Your answer"
		],
		"value": [],
		"comment": ""
	},
	{
		"question": "Tell us what exactly you do not like?",
		"type": "textarea",
		"value": ""
	}
]