{
    "/js/vue.js": "/js/vue.js?id=5c1c9e95a728bb21b838",
    "/js/admin-app.js": "/js/admin-app.js?id=983646ca843c8c0bc534",
    "/js/modules.js": "/js/modules.js?id=a9070f80a8fed47cdfad",
    "/css/admin-app.css": "/css/admin-app.css?id=b29f5265a40a7553791c"
}
