Value,Description
60,Planktivorous_fish_spawning_start_day
90,Planktivorous_fish_spawning_duration_(days)
200,Planktivorous_fish_recruitment_start_day
150,Planktivorous_fish_recruitment_duration_(days)
60,Demersal_fish_spawning_start_day
90,Demersal_fish_spawning_duration_(days)
200,Demersal_fish_recruitment_start_day
150,Demersal_fish_recruitment_duration_(days)
60,Susp/dep_benthos_spawning_start_day
150,Susp/dep_benthos_spawning_duration_(days)
180,Susp/dep_benthos_recruitment_start_day
120,Susp/dep_benthos_recruitment_duration_(days)
60,Carn/scav_benthos_spawning_start_day
150,Carn/scav_benthos_spawning_duration_(days)
180,Carn/scav_benthos_recruitment_start_day
120,Carn/scav_benthos_recruitment_duration_(days)
1,Migratory_fish_switch_(0=off_1=on)
3800000,Migratory_fish_ocean_biomass_(Tonnes_wet_weight)
0.184,Migratory_fish_carbon_to_wet_weight_(g/g)
1608975.7,Model_domain_sea_surface_area_(km2)
0.05,Propn_of_ocean_population_entering_model_domain_each_year
150,Migratory_fish_immigration_start_day
195,Migratory_fish_immigration_end_day_(must_be_later_than_start_day_even_if_migration_disabled)
0.01,Migratory_fish_propn_of_peak_popn_in_model_domain_which_remains_and_does_not_emigrate
240,Migratory_fish_emigration_start_day
285,Migratory_fish_emigration_end_day_(must_be_later_than_start_day_even_if_migration_disabled)
1,Bird_winter_migration_switch_(0=off_1=on)
90,Bird_spring_immigration_start_day
150,Bird_spring_immigration_end_day_(must_be_later_than_start_day_even_if_migration_disabled)
0.05,Bird_propn_of_peak_popn_in_model_domain_which_remains_and_does_not_emigrate_(must_be>0)
270,Bird_autumn_emigration_start_day
315,Bird_autumn_emigration_end_day_(must_be_later_than_start_day_even_if_migration_disabled)
0,Pinniped_winter_migration_switch_(0=off_1=on)
90,Pinniped_spring_immigration_start_day
150,Pinniped_spring_immigration_end_day_(must_be_later_than_start_day_even_if_migration_disabled)
0.85,Pinniped_propn_of_peak_popn_in_model_domain_which_remains_and_does_not_emigrate_(must_be>0)
270,Pinniped_autumn_emigration_start_day
315,Pinniped_autumn_emigration_end_day_(must_be_later_than_start_day_even_if_migration_disabled)
1,Cetacean_winter_migration_switch_(0=off_1=on)
90,Cetacean_spring_immigration_start_day
150,Cetacean_spring_immigration_end_day_(must_be_later_than_start_day_even_if_migration_disabled)
0.25,Cetacean_propn_of_peak_popn_in_model_domain_which_remains_and_does_not_emigrate_(must_be>0)
270,Cetacean_autumn_emigration_start_day
315,Cetacean_autumn_emigration_end_day_(must_be_later_than_start_day_even_if_migration_disabled)
1,Maritime_mammal_winter_migration_switch_(0=off_1=on)
75,Maritime_mammal_spring_immigration_start_day
150,Maritime_mammal_spring_immigration_end_day_(must_be_later_than_start_day_even_if_migration_disabled)
0.85,Maritime_mammal_propn_of_peak_popn_in_model_domain_which_remains_and_does_not_emigrate_(must_be>0)
270,Maritime_mammal_autumn_emigration_start_day
315,Maritime_mammal_autumn_emigration_end_day_(must_be_later_than_start_day_even_if_migration_disabled)
