"detritus_so",0.345955568643109
"detritus_d",0.982216168694264
"x_detritus_s1",7.98207696358995
"x_detritus_s2",9.12416141532196
"x_detritus_s3",2.00345511453323
"x_detritus_d1",37.2423523000098
"x_detritus_d2",8.31050677089968
"x_detritus_d3",2.91971269114226
"xR_detritus_s1",2817.21548141526
"xR_detritus_s2",2135.45856952168
"xR_detritus_s3",505.767929215242
"xR_detritus_d1",7621.29241395747
"xR_detritus_d2",3117.99954194812
"xR_detritus_d3",1462.91911593137
"discard_o",0.00905006591792755
"corpse_s1",0.0744379403858457
"corpse_s2",0.0897353703221402
"corpse_s3",0.0195666679872248
"corpse_d1",0.477541146796637
"corpse_d2",0.0968792289869174
"corpse_d3",0.0333170862433284
"ammonia_so",103.112249196658
"ammonia_d",274.924938369305
"x_ammonia_s1",0.214466344638885
"x_ammonia_s2",0.15731247868883
"x_ammonia_s3",0.0321314454601984
"x_ammonia_d1",1.20622850882203
"x_ammonia_d2",0.137784173835727
"x_ammonia_d3",0.0405702894641224
"nitrate_so",380.241289108186
"nitrate_d",1181.67741979456
"x_nitrate_s1",0.105224535891714
"x_nitrate_s2",0.133897880712999
"x_nitrate_s3",0.0345602615680267
"x_nitrate_d1",0.316436562669448
"x_nitrate_d2",0.278398866831295
"x_nitrate_d3",0.149264614110682
"phyt_so",0.399169199430591
"phyt_d",0.364310309199847
"omni_o",14.1083692502998
"carn_o",8.36224957241687
"benthslar_o",7.5604317997928e-06
"benths_o",21.3301902051188
"benthclar_o",3.27949705333779e-06
"benthc_o",7.57972521399001
"fishp_o",3.32243117628556
"fishplar_o",2.25170420022883e-07
"fishd_o",6.24577357100042
"fishdlar_o",1.87465486460568e-06
"fishm_o",0.00273873520931005
"bird_o",0.00113084257001391
"detritus_si",0.2676127375944
"ammonia_si",69.9482196860536
"nitrate_si",85.3982115278108
"phyt_si",0.020781436794894
"benthslar_i",1.52659041737569e-06
"benthclar_i",7.27544110442034e-07
"benths_i",5.31888143384231
"benthc_i",1.78326177532837
"discard_i",0.00142717187893201
"omni_i",2.10138575186768
"carn_i",0.917331600125643
"fishplar_i",5.54770856154231e-08
"fishdlar_i",5.82117073610285e-07
"fishp_i",0.374655441092416
"fishm_i",8.11149938623142e-05
"fishd_i",1.6871492890796
"bird_i",8.05671763213336e-05
"seal_o",0.0673602537477277
"seal_i",0.00329927886153384
"ceta_o",0.169400866062068
"ceta_i",0.0043375709565412
"corpse_s0",0.0114709071992368
"corpse_d0",0.00505533686986262
"kelpC",396.487363288015
"kelpN",52.8447014865528
"kelpdebris",6.98434546117026
"snow_ammonia_o",0.0200488655328789
"snow_nitrate_o",0.0285309741654123
"ice_ammonia_o",0.0271902625872211
"ice_nitrate_o",0.0285138570279701
"ice_detritus_o",0.00062774991203442
"ice_algae_o",0.000119297954017583
"snow_ammonia_i",0.0152445202824551
"snow_nitrate_i",0.0146815405759585
"ice_ammonia_i",0.0310917926287192
"ice_nitrate_i",0.00148354230274962
"ice_detritus_i",0.00295809847356004
"ice_algae_i",0.000166856956395095
"bear_o",0.00177323593595033
"bear_i",0.000485480305932959
"htlcorp_o",4.35060504873785e-05
"htlcorp_i",2.51472007446582e-07
"wintering_bird_o",0.0211422663279072
"wintering_bird_i",0.00116024085586505
"wintering_seal_o",0
"wintering_seal_i",0
"wintering_ceta_o",0.526531381437593
"wintering_ceta_i",0.0131026542461335
"wintering_bear_o",0
"wintering_bear_i",0.000365136907644156
