Gear_id,Gear_name,Gear_to_which_linked,Linkage_coefficient,Comments
1,Pelagic_trawl+seine,NA,NA,Independent_of_other_gears
2,Demersal_otter_trawl,NA,NA,Independent_of_other_gears
3,Demersal_seine,2,1,Guess
4,Gill_nets,NA,NA,Independent_of_other_gears
5,Longlines and Jiggiing,4,1,Guess
6,Recreational,NA,NA,Independent_of_other_gears
7,Shrimp_trawl,NA,NA,Independent_of_other_gears
8,Creels,7,1,Guess
9,Mollusc_dredge,NA,NA,Independent_of_other_gears
10,Harpoons,NA,NA,Independent_of_other_gears
11,Rifles,NA,NA,Independent_of_other_gears
12,Kelp_harvester,NA,NA,Independent_of_other_gears
