"Gear_name","Gear_code","Habitat_s0","Habitat_s1","Habitat_s2","Habitat_s3","Habitat_d0","Habitat_d1","Habitat_d2","Habitat_d3"
"Pelagic_trawl+seine","PTS",0.0612987246781706,0.0457309212690445,0.0304508164538911,0.0444755765247486,0.0285616833084847,0.46584825116781,0.211410245397456,0.112223781200395
"Demersal_otter_trawl","OT",0.0163544155365857,0.0258730601550431,0.0209101349801646,0.0186122737725336,0.0137392042005442,0.572247269505399,0.194608574516638,0.137655067333092
"Demersal_seine","DS",0.0682511424919726,0.0489826652101937,0.0293425918550877,0.0506936137206182,0.0256678042652305,0.47661256009141,0.197932087644415,0.102517534721073
"Gill_nets","GN",0.0958096904386319,0.107711636398378,0.0392478196115166,0.0670150893818623,0.057500038668172,0.262057983002408,0.187215361200391,0.18344238129864
"Longlines and Jiggiing","LLJ",0.0478869059691165,0.0267407289106054,0.0154992540851386,0.0424016683191304,0.0185465041081959,0.58466665536229,0.160156762018436,0.104101521227087
"Recreational","Rec",0.0627400769760099,0.39316039536708,0.449933410914745,0.0941661167421656,0,0,0,0
"Shrimp_trawl","ST",0.0378205434437504,0.0343224830853274,0.0216639316903175,0.0298903867063999,0.0135327812155067,0.595148295240734,0.184689421152153,0.0829321574658115
"Creels","CR",0.00048245152154877,0.00155987462597561,0.000374392676083484,0.000413861167484913,0.000249636786454253,0.826334851161656,0.10225790400132,0.0683270280594772
"Mollusc_dredge","MD",0.000168783309772999,0.00328918090049388,0.00652443575306472,0.00111041976276618,0.00164957376497536,0.858405537503207,0.10717913071832,0.0216729382873996
"Harpoons","Harp",0.0615818163639987,0.0651646395365617,0.0350022687135126,0.0747013579836244,0.0327726447022194,0.366617051149722,0.118991656499708,0.245168565050654
"Rifles","Rif",0.0566587396090596,0,0.921234304442024,0.0221069559489158,0,0,0,0
"Kelp_harvester","KH",1,0,0,0,0,0,0,0
