Gear_name,Gear_code,Power_PF,Power_DF,Power_MF,Power_FDB,Power_CSB,Power_CZ,Power_BD,Power_SL,Power_CT,Power_KP
Pelagic_trawl+seine,PTS,4412.879918,564.6265706,43.96727801,0,0.001430116,0,0,0,1.15359E-06,0
Demersal_otter_trawl,OT,9.476475405,108.6048743,0.000618181,0,5.711019581,2.32858E-05,0,0,3.45212E-05,0
Demersal_seine,DS,5.530486938,191.8358843,0.000399256,0.000206189,0.007455138,0.000407974,0,0,0.000361212,0
Gill_nets,GN,1.967463919,74.27560822,0.001113764,0,0.044770509,2.57965E-06,0.042669694,0.1313954,0.334846341,0
Longlines and Jiggiing,LLJ,0.585519018,70.43098725,0.000110095,5.06821E-06,0.005093318,0,0.012641266,0,0.0005817,0
Recreational,Rec,0,2.959993593,0.010372385,0,0,0,0,0,0,0
Shrimp_trawl,ST,96.79019654,49.86454284,0,0,28.30998795,1.60127E-06,0,0,0,0
Creels,CR,8.38906E-05,0.004993294,0,0,5.445634756,0,0,0,0.000249353,0
Mollusc_dredge,MD,0,0,0,5.277547512,0,0,0,0,0,0
Harpoons,Harp,0,0,0,0,0,0,0,0,351.2894935,0
Rifles,Rif,0,0,0,0,0,0,0,23.879,0,0
Kelp_harvester,KH,0,0,0,0,0,0,0,0,0,30
