"consumer","Cumax","Cddexud","Numax","Nhsat","BdeApar","ddmort","migration_coef","max_exploitable_f"
"kelp",0.0194370146560947,1.62191053501326e-08,0.00545485241183228,16.795477791375,NA,2.84453754528437e-08,NA,0.0271540823937651
"icealg",NA,NA,4.50124243606678,2.79337116027913,NA,3.09436892336128,NA,NA
"phyt_s",NA,NA,3.60967251916011,4.11478640442862,NA,0.0273642404496131,NA,NA
"phyt_d",NA,NA,NA,NA,NA,0.0399224391890633,NA,NA
"omnivzoo",NA,NA,2.30280032500225,2.2511401202786,NA,1.7586591290719e-05,NA,NA
"carnzoo",NA,NA,0.176863310981475,1.78533381505119,NA,0.000564763020772925,NA,0.00419972569855937
"fishplar",NA,NA,0.395546660955201,6.56134553989552,NA,4.01515364370582e-06,NA,NA
"fishdlar",NA,NA,0.13619001022923,2.72315507380444,NA,5.10891806780796e-07,NA,NA
"fishp",NA,NA,0.121319403470112,2.39589309227119,NA,5.20892507942994e-05,0.00166701159351018,0.999974248369225
"fishm",NA,NA,0.0377411682282003,2.11075594930659,NA,1.69646296845009e-06,3.60569462844971e-05,0.594364522129945
"fishd",NA,NA,0.0115374059505694,0.384493382366602,NA,6.70273348334847e-05,0.00149872493305198,0.524498048481752
"benthslar",NA,NA,0.363756870229525,0.585837452113199,NA,5.73022360987494e-06,NA,NA
"benthclar",NA,NA,1.24359769364588,2.52507434854259,NA,2.93750955843202e-07,NA,NA
"benths",NA,NA,2.00187506013478,1.30736861023716,NA,0.000157478469733156,NA,0.0216343166491133
"benthc",NA,NA,0.0364495968981598,7.99334864334926,NA,0.000551061353784215,NA,0.107381210282908
"bird",NA,NA,0.810741610441176,0.919887280927767,4087.38198482137,0.0468954953273386,0.00938299671948892,0.0952976549081252
"seal",NA,NA,0.33699566808905,2.02199423402147,2121.60926332798,0.000171385267762065,0.00880400203023362,0.0984986728456157
"ceta",NA,NA,0.166542907730916,0.610886305311742,814.513005785721,0.00010713928903183,0.00991318682512877,0.285144345148483
"bear",NA,NA,0.421480093322254,0.054294097491083,497.395188647816,0.00140559343542205,0.00911610475508413,NA
