Gear_name,Gear_code,Multiplier_to_be_applied_to_activity
Pelagic_trawl+seine,PTS,1
Demersal_otter_trawl,OT,1
Demersal_seine,DS,1
Gill_nets,GN,1
Longlines and Jiggiing,LLJ,1
Recreational,Rec,1
Shrimp_trawl,ST,1
Creels,CR,1
Mollusc_dredge,MD,1
Harpoons,Harp,1
Rifles,Rif,1
Kelp_harvester,KH,1
