"PlankFishHRmult","DemFishHRmult","PlankFishbiom","PlankFishland","PlankFishdisc","DemFishbiom","DemFishland","DemFishdisc","MigFishbiom","MigFishland","MigFishdisc","Benthsuspdepbiom","Benthsuspdepland","Benthsuspdepdisc","Benthcarnscavbiom","Benthcarnscavland","Benthcarnscavdisc","CarnivZoobiom","CarnivZooland","CarnivZoodisc","Birdbiom","Birdland","Birddisc","Pinnipedbiom","Pinnipedland","Pinnipeddisc","Cetaceanbiom","Cetaceanland","Cetaceandisc","Macrophytebiom","Macrophyteland","Macrophytedisc","Phytoplanktonbiom","OmnivZoobiom"
1,0,4.16605361460353,0.726463846704902,0.00139739794188942,26.6230209476438,0,0,4.73062715837476,0.999400201233108,0.123537587141878,49.1396771514675,0.0750547237522001,0.000426567140883492,17.2517388424978,0.150956400262197,0.094795580825779,15.7486132559435,0.00884212760826153,0,0.0100187249150334,0,5.52167355343712e-07,0.059729634284019,0,3.40652550890972e-05,0.0493542455716757,4.1091320734158e-05,0.000108733767852203,19.3874322762594,0,0,7.31478060698778,25.7324880649453
1,0.1,4.79157997829347,0.838504044440086,0.00161306084738802,26.2772549754942,0.093643137587069,0.0994450143867756,4.73128949588014,0.999544728811529,0.123554891352213,49.1691019953962,0.075118177645713,0.000426927735170245,17.0940795509206,0.149277733273212,0.0935743666858944,15.5347815765223,0.00868282781499718,0,0.010119186055148,0,5.57773008038982e-07,0.0593543714054693,0,3.37437805831213e-05,0.0510675501167044,4.45258286845126e-05,0.000120607767477904,19.3936033434829,0,0,7.29894056118457,25.8770921600587
1,0.2,5.46455005774899,0.959087045086093,0.00184519114426057,25.9317694429517,0.184790972070836,0.196233753225149,4.73196321506588,0.999692065735879,0.123572523661102,49.1989617805135,0.0751824378230666,0.000427292939167975,16.9256751902714,0.147493679682491,0.0922826423530561,15.3020991799379,0.00850983394815924,0,0.0102311199967972,0,5.6403775053429e-07,0.0590134818681802,0,3.34369919311223e-05,0.0528990254843983,4.81968582331524e-05,0.000133305013014512,19.4000511894909,0,0,7.28207700412016,26.0318495050391
1,0.5,7.68666939834162,1.3575707639034,0.00261246840619073,24.8880450616446,0.443129862651794,0.470520486101147,4.73428891881746,1.00019942515456,0.123633439674942,49.2906379144162,0.0753754563008364,0.000428390047324305,16.3734961101851,0.141700037483334,0.0881262962597171,14.5222909176673,0.00793275274533234,0,0.0106056923966834,0,5.85055183599479e-07,0.0581103672458896,0,3.25667132904952e-05,0.058797760080004,6.00309048972144e-05,0.00017408669595205,19.4207478332507,0,0,7.2268459616905,26.5415726351823
1,1,11.5457788634528,2.05074634999332,0.00394776742260275,23.0873951104268,0.821283210270934,0.871886128209631,4.7391389331445,1.00125375950859,0.123760976481549,49.4422694389617,0.0756767024908918,0.000430102764281688,15.4202310886092,0.131879950076383,0.0812073799632378,13.1549244363247,0.00692605472074959,0,0.011192319871925,0,6.17897363729308e-07,0.0565023162499745,0,3.10656810310298e-05,0.0683002669523688,7.91685154490534e-05,0.000238986150311937,19.457450877452,0,0,7.1296785720341,27.4352347995384
1,2,18.0509759930109,3.22216922084104,0.00620588143588541,19.2096214392514,1.3635984283615,1.44710499219661,4.75090435904555,1.00380390075838,0.124072113441018,49.6870149639406,0.0760940214502117,0.000432476714094021,13.8753774999201,0.116517011140996,0.0707724656853594,10.899979884935,0.00527458644156148,0,0.0117702808720492,0,6.49277000692091e-07,0.0513677713134431,0,2.72205841750077e-05,0.0815117630756069,0.000106133250232994,0.000325332650209658,19.5307678789997,0,0,6.95574876538612,28.9777333889207
1,2.5,20.6936347909167,3.6988691616036,0.00712523025082967,17.1640021074682,1.52108597640651,1.61397854903046,4.75715387938986,1.00515611607702,0.124237698726775,49.7723898855637,0.076203402960008,0.000433099690140555,13.3067594124599,0.111101568582837,0.0672693515240264,10.0260842970458,0.00463655764096083,0,0.0118032381261559,0,6.5020354623783e-07,0.0478965685305883,0,2.49038910179935e-05,0.0856570895776836,0.000114809560367324,0.000350078290852065,19.5669234335913,0,0,6.88112733677216,29.6079269392212
1,3,23.055776980301,4.12518045191604,0.00794751312989161,15.0686972627883,1.60023146926804,1.69770170061571,4.76350412884541,1.00653104065361,0.12440623100011,49.836269408487,0.076259095230137,0.000433417643838981,12.845396918687,0.106849086160993,0.0646268237569814,9.27459497272226,0.00408853855470176,0,0.011715113594461,0,6.44136678910861e-07,0.0439550307878765,0,2.23844190219116e-05,0.0886815575141083,0.000121311492449269,0.000366264599298567,19.60297120767,0,0,6.81305545288722,30.1651137576866
1,3.5,25.1976659858579,4.51178718050147,0.00869323828782653,12.9368570685497,1.60016143766322,1.6973864853241,4.76987887859347,1.0079102069291,0.124575346238717,49.8821497710918,0.0762710086444347,0.000433486880435589,12.4736110975084,0.103548824386345,0.0626761954427746,8.62204450608598,0.00361305195207212,0,0.0115276434892381,0,6.32326514437114e-07,0.0396029101060906,0,1.96925986854992e-05,0.09081607813067,0.000126097037846987,0.000375545421959347,19.6389207711568,0,0,6.75074734136552,30.6601412849198
1,4,27.1561774895672,4.86524475414203,0.00937499843055722,10.7829089135615,1.52110733887046,1.61331323247245,4.77624289831366,1.00928771935001,0.124744271820148,49.9134594706252,0.0762485609698516,0.00043336091208105,12.1776423178746,0.101036169433662,0.0612853161465448,8.05302035271472,0.00319867864011306,0,0.011254994203422,0,6.15593540128118e-07,0.0348799569336698,0,1.68542118794172e-05,0.0922094878690778,0.000129457767277939,0.000379026280425146,19.6746467751996,0,0,6.69377037151067,31.1000113724167
1,4.5,28.9509263652898,5.1890712769453,0.00999956748923925,8.62833422091953,1.36544087185378,1.44802757273413,4.7825724370475,1.01065809368111,0.124912324840345,49.9334931989582,0.0762008640523479,0.000433091498983951,11.9464179763698,0.0991785776166028,0.0603477268445274,7.55751996470662,0.00283809532519436,0,0.0109084991685824,0,5.94604166186841e-07,0.029826204102697,0,1.39020013920383e-05,0.092966898042797,0.000131592335404528,0.000377567167879105,19.7098427708062,0,0,6.64199681292374,31.4888458658015
1,5,30.580917859995,5.4830808836133,0.0105665835009392,6.51500199230598,1.14066777386284,1.20951404367293,4.78873401661579,1.01199164538409,0.125075850193543,49.9450433537524,0.0761366012635865,0.000432727951641877,11.7712861004673,0.0978683201952943,0.0597743328904063,7.1309671064957,0.00252784064992806,0,0.0105020708701764,0,5.70183799897173e-07,0.0245219198417633,0,1.0897506160979e-05,0.0931755628858363,0.000132657860231904,0.00037196673335935,19.7438724353602,0,0,6.59568452145549,31.8274822701866
1,6,33.1858627075275,5.95305636460608,0.0114730189351184,2.85776590981468,0.587894382623993,0.623229990706221,4.79946888455773,1.01431500204722,0.125360782895444,49.9510595144164,0.0759951300972137,0.000431926944066362,11.5521668580393,0.0964261622337901,0.059335812483388,6.48824106245941,0.00206175388592963,0,0.00965233661572167,0,5.19541437714019e-07,0.0143309507492013,0,5.43900752370474e-06,0.0925122253769972,0.000132501678068432,0.000354591403600602,19.8022581289868,0,0,6.52283761201292,32.3448793146965
1,7,34.4780115459026,6.18631365027881,0.0119229677081893,0.977269756605903,0.217970645986142,0.231014788236116,4.80518450650491,1.01555156885926,0.125512447072084,49.9481716484774,0.0759081095610563,0.000431434015944494,11.4641187032475,0.0959332257551768,0.059282026963714,6.1787790670992,0.00184301450039645,0,0.00914480174151044,0,4.8947593799645e-07,0.00827328056957098,0,2.44992379318937e-06,0.0917953141364285,0.000131693039496988,0.000342779494903904,19.832478885245,0,0,6.48721698808398,32.5939975726742
1,8,34.8272366060405,6.24936621039831,0.012044600505244,0.480760542992529,0.108019032256486,0.114456411671149,4.80672341725668,1.01588537360965,0.125553394868728,49.9469466327363,0.0758838692519328,0.000431296696198166,11.4419335602393,0.0958173230188999,0.0592802095190921,6.09483137477338,0.00178603760632737,0,0.00900324969408036,0,4.81108723808291e-07,0.00643091220906859,0,1.592528549978e-06,0.091592483783585,0.000131454560647941,0.000339543287598665,19.8404778123129,0,0,6.47785132549407,32.659624756359
1,9,34.9255435317018,6.26711939057753,0.0120788495498342,0.339281620320544,0.0762989203236408,0.0808277493976846,4.80718117817018,1.01598397186042,0.125565492065348,49.9465721161412,0.075877033707469,0.000431257973988013,11.4359903772559,0.0957877712629545,0.0592818403207076,6.07142965687381,0.00177028460585901,0,0.0089622233156841,0,4.78685321165561e-07,0.00588255340857322,0,1.34228897883987e-06,0.0915298211864966,0.00013137702038883,0.000338585528316285,19.8427388524145,0,0,6.47522296009258,32.6779295813387
1,10,34.9691487576762,6.27499578997157,0.0120940453525882,0.275021031693789,0.0619565977135075,0.0656201769509472,4.80738953848747,1.01602970487913,0.125571103681861,49.9464031091628,0.0758738974784228,0.000431240206442064,11.4334769175229,0.0957758809328091,0.0592833908657386,6.06121482126183,0.00176342391283557,0,0.0089433700360934,0,4.7757222064424e-07,0.00563827992058198,0,1.23134252563839e-06,0.091498452311875,0.000131336006347875,0.000338130089158496,19.8437597724165,0,0,6.4740527002519,32.6860332430354
