using System;
using System.Collections.Generic;
using System.Linq;
using System.Text;
using System.Threading.Tasks;

namespace Calculator
{
    class Program
    {
        static void Main()
        {
            int a, sum = 0;
            for (a = 1; a <= 100; a++)
            {
                sum = sum + a;
                    
            }
            Console.WriteLine("Sum = " + sum);
            Console.ReadKey();


        }
    }
}
